{"text_format":"1","workbook":"xlsx","n_sheets":4,"sheets":["Mainframe","Scoresheet","Answers","Backup 2"],"not_rendered":{"charts":0,"images":0,"macros":0,"external_links":0,"defined_names":6,"comments":0,"pivot_tables":0},"unopened":[],"bounds":{"document_bytes":16777216,"sheet_cells":100000,"rows_first":2000,"rows_last":500,"rows_between":2000,"halvings":0,"cell_chars":16384,"cell_head_chars":4096},"cells_cut":0,"cells_raw":0,"read":"whole","date_system":"1900"}

{"sheet":"Mainframe","index":0,"n_rows":1,"n_cols":24,"rows_kept":1,"cut":false,"hidden":false,"merged":[]}
["Timestamp","Handle","Question 1","Question 2","Question 3","Question 4","Question 5","Question 6","Question 7","Question 8","Question 9","Question 10","Question 11","Question 12","Question 13","Question 14","Question 15","Question 16","Question 17","Question 18","Question 19","Question 20",null,{"$f":"COUNTA(B:B)-1","v":0}]

{"sheet":"Scoresheet","index":1,"n_rows":55,"n_cols":90,"rows_kept":55,"cut":false,"hidden":false,"merged":[[0,86,0,88],[0,3,0,6],[0,7,0,10],[0,11,0,14],[0,15,0,18],[0,19,0,22],[0,23,0,26],[0,27,0,30],[0,31,0,34],[0,35,0,38],[0,39,0,42],[0,43,0,46],[0,47,0,50],[0,51,0,54],[0,55,0,58],[0,59,0,62],[0,63,0,66],[0,67,0,70],[0,71,0,74],[0,75,0,78],[0,79,0,82]]}
[null,null,null,"Question 1",null,null,null,"Question 2",null,null,null,"Question 3",null,null,null,"Question 4",null,null,null,"Question 5",null,null,null,"Question 6",null,null,null,"Question 7",null,null,null,"Question 8",null,null,null,"Question 9",null,null,null,"Question 10",null,null,null,"Question 11",null,null,null,"Question 12",null,null,null,"Question 13",null,null,null,"Question 14",null,null,null,"Question 15",null,null,null,"Question 16",null,null,null,"Question 17",null,null,null,"Question 18",null,null,null,"Question 19",null,null,null,"Question 20",null,null,null,null,"Question #",1,"Automated answer compilation",null,null,"Automated standings"]
[null,"Player","Order","Response","Resp","Adj","Total","Response","Resp","Adj","Total","Response","Resp","Adj","Total","Response","Resp","Adj","Total","Response","Resp","Adj","Total","Response","Resp","Adj","Total","Response","Resp","Adj","Total","Response","Resp","Adj","Total","Response","Resp","Adj","Total","Response","Resp","Adj","Total","Response","Resp","Adj","Total","Response","Resp","Adj","Total","Response","Resp","Adj","Total","Response","Resp","Adj","Total","Response","Resp","Adj","Total","Response","Resp","Adj","Total","Response","Resp","Adj","Total","Response","Resp","Adj","Total","Response","Resp","Adj","Total","Response","Resp","Adj","Total",null,null,"Rank",null,"Resp list","Filter","Standings"]
["[*]",{"$f":"Mainframe!B2","v":0},1,{"$f":"Mainframe!C2","v":0},{"$f":"IF(D3=0,\"\",IF(NOT(ISNA(VLOOKUP(D3,Answers!A:B,2,FALSE))),VLOOKUP(D3,Answers!A:B,2,FALSE),\"Help!\"))","v":""},null,{"$f":"IF(E3=\"\",\"\",IF(E3=\"XX\",VLOOKUP(\"WRONG\",Answers!A:B,2,FALSE),E3)+F3)","v":""},{"$f":"Mainframe!D2","v":0},{"$f":"IF(H3=0,\"\",IF(NOT(ISNA(VLOOKUP(H3,Answers!C:D,2,FALSE))),VLOOKUP(H3,Answers!C:D,2,FALSE),\"Help!\"))","v":""},null,{"$f":"IF(I3=\"\",\"\",G3+IF(I3=\"XX\",VLOOKUP(\"WRONG\",Answers!C:D,2,FALSE),I3)+J3)","v":""},{"$f":"Mainframe!E2","v":0},{"$f":"IF(L3=0,\"\",IF(NOT(ISNA(VLOOKUP(L3,Answers!E:F,2,FALSE))),VLOOKUP(L3,Answers!E:F,2,FALSE),\"Help!\"))","v":""},null,{"$f":"IF(M3=\"\",\"\",K3+IF(M3=\"XX\",VLOOKUP(\"WRONG\",Answers!E:F,2,FALSE),M3)+N3)","v":""},{"$f":"Mainframe!F2","v":0},{"$f":"IF(P3=0,\"\",IF(NOT(ISNA(VLOOKUP(P3,Answers!G:H,2,FALSE))),VLOOKUP(P3,Answers!G:H,2,FALSE),\"Help!\"))","v":""},null,{"$f":"IF(Q3=\"\",\"\",O3+IF(Q3=\"XX\",VLOOKUP(\"WRONG\",Answers!G:H,2,FALSE),Q3)+R3)","v":""},{"$f":"Mainframe!G2","v":0},{"$f":"IF(T3=0,\"\",IF(NOT(ISNA(VLOOKUP(T3,Answers!I:J,2,FALSE))),VLOOKUP(T3,Answers!I:J,2,FALSE),\"Help!\"))","v":""},null,{"$f":"IF(U3=\"\",\"\",S3+IF(U3=\"XX\",VLOOKUP(\"WRONG\",Answers!I:J,2,FALSE),U3)+V3)","v":""},{"$f":"Mainframe!H2","v":0},{"$f":"IF(X3=0,\"\",IF(NOT(ISNA(VLOOKUP(X3,Answers!K:L,2,FALSE))),VLOOKUP(X3,Answers!K:L,2,FALSE),\"Help!\"))","v":""},null,{"$f":"IF(Y3=\"\",\"\",W3+IF(Y3=\"XX\",VLOOKUP(\"WRONG\",Answers!K:L,2,FALSE),Y3)+Z3)","v":""},{"$f":"Mainframe!I2","v":0},{"$f":"IF(AB3=0,\"\",IF(NOT(ISNA(VLOOKUP(AB3,Answers!M:N,2,FALSE))),VLOOKUP(AB3,Answers!M:N,2,FALSE),\"Help!\"))","v":""},null,{"$f":"IF(AC3=\"\",\"\",AA3+IF(AC3=\"XX\",VLOOKUP(\"WRONG\",Answers!M:N,2,FALSE),AC3)+AD3)","v":""},{"$f":"Mainframe!J2","v":0},{"$f":"IF(AF3=0,\"\",IF(NOT(ISNA(VLOOKUP(AF3,Answers!O:P,2,FALSE))),VLOOKUP(AF3,Answers!O:P,2,FALSE),\"Help!\"))","v":""},null,{"$f":"IF(AG3=\"\",\"\",AE3+IF(AG3=\"XX\",VLOOKUP(\"WRONG\",Answers!O:P,2,FALSE),AG3)+AH3)","v":""},{"$f":"Mainframe!K2","v":0},{"$f":"IF(AJ3=0,\"\",IF(NOT(ISNA(VLOOKUP(AJ3,Answers!Q:R,2,FALSE))),VLOOKUP(AJ3,Answers!Q:R,2,FALSE),\"Help!\"))","v":""},null,{"$f":"IF(AK3=\"\",\"\",AI3+IF(AK3=\"XX\",VLOOKUP(\"WRONG\",Answers!Q:R,2,FALSE),AK3)+AL3)","v":""},{"$f":"Mainframe!L2","v":0},{"$f":"IF(AN3=0,\"\",IF(NOT(ISNA(VLOOKUP(AN3,Answers!S:T,2,FALSE))),VLOOKUP(AN3,Answers!S:T,2,FALSE),\"Help!\"))","v":""},null,{"$f":"IF(AO3=\"\",\"\",AM3+IF(AO3=\"XX\",VLOOKUP(\"WRONG\",Answers!S:T,2,FALSE),AO3)+AP3)","v":""},{"$f":"Mainframe!M2","v":0},{"$f":"IF(AR3=0,\"\",IF(NOT(ISNA(VLOOKUP(AR3,Answers!U:V,2,FALSE))),VLOOKUP(AR3,Answers!U:V,2,FALSE),\"Help!\"))","v":""},null,{"$f":"IF(AS3=\"\",\"\",AQ3+IF(AS3=\"XX\",VLOOKUP(\"WRONG\",Answers!U:V,2,FALSE),AS3)+AT3)","v":""},{"$f":"Mainframe!N2","v":0},{"$f":"IF(AV3=0,\"\",IF(NOT(ISNA(VLOOKUP(AV3,Answers!W:X,2,FALSE))),VLOOKUP(AV3,Answers!W:X,2,FALSE),\"Help!\"))","v":""},null,{"$f":"IF(AW3=\"\",\"\",AU3+IF(AW3=\"XX\",VLOOKUP(\"WRONG\",Answers!W:X,2,FALSE),AW3)+AX3)","v":""},{"$f":"Mainframe!O2","v":0},{"$f":"IF(AZ3=0,\"\",IF(NOT(ISNA(VLOOKUP(AZ3,Answers!Y:Z,2,FALSE))),VLOOKUP(AZ3,Answers!Y:Z,2,FALSE),\"Help!\"))","v":""},null,{"$f":"IF(BA3=\"\",\"\",AY3+IF(BA3=\"XX\",VLOOKUP(\"WRONG\",Answers!Y:Z,2,FALSE),BA3)+BB3)","v":""},{"$f":"Mainframe!P2","v":0},{"$f":"IF(BD3=0,\"\",IF(NOT(ISNA(VLOOKUP(BD3,Answers!AA:AB,2,FALSE))),VLOOKUP(BD3,Answers!AA:AB,2,FALSE),\"Help!\"))","v":""},null,{"$f":"IF(BE3=\"\",\"\",BC3+IF(BE3=\"XX\",VLOOKUP(\"WRONG\",Answers!AA:AB,2,FALSE),BE3)+BF3)","v":""},{"$f":"Mainframe!Q2","v":0},{"$f":"IF(BH3=0,\"\",IF(NOT(ISNA(VLOOKUP(BH3,Answers!AC:AD,2,FALSE))),VLOOKUP(BH3,Answers!AC:AD,2,FALSE),\"Help!\"))","v":""},null,{"$f":"IF(BI3=\"\",\"\",BG3+IF(BI3=\"XX\",VLOOKUP(\"WRONG\",Answers!AC:AD,2,FALSE),BI3)+BJ3)","v":""},{"$f":"Mainframe!R2","v":0},{"$f":"IF(BL3=0,\"\",IF(NOT(ISNA(VLOOKUP(BL3,Answers!AE:AF,2,FALSE))),VLOOKUP(BL3,Answers!AE:AF,2,FALSE),\"Help!\"))","v":""},null,{"$f":"IF(BM3=\"\",\"\",BK3+IF(BM3=\"XX\",VLOOKUP(\"WRONG\",Answers!AE:AF,2,FALSE),BM3)+BN3)","v":""},{"$f":"Mainframe!S2","v":0},{"$f":"IF(BP3=0,\"\",IF(NOT(ISNA(VLOOKUP(BP3,Answers!AG:AH,2,FALSE))),VLOOKUP(BP3,Answers!AG:AH,2,FALSE),\"Help!\"))","v":""},null,{"$f":"IF(BQ3=\"\",\"\",BO3+IF(BQ3=\"XX\",VLOOKUP(\"WRONG\",Answers!AG:AH,2,FALSE),BQ3)+BR3)","v":""},{"$f":"Mainframe!T2","v":0},{"$f":"IF(BT3=0,\"\",IF(NOT(ISNA(VLOOKUP(BT3,Answers!AI:AJ,2,FALSE))),VLOOKUP(BT3,Answers!AI:AJ,2,FALSE),\"Help!\"))","v":""},null,{"$f":"IF(BU3=\"\",\"\",BS3+IF(BU3=\"XX\",VLOOKUP(\"WRONG\",Answers!AI:AJ,2,FALSE),BU3)+BV3)","v":""},{"$f":"Mainframe!U2","v":0},{"$f":"IF(BX3=0,\"\",IF(NOT(ISNA(VLOOKUP(BX3,Answers!AK:AL,2,FALSE))),VLOOKUP(BX3,Answers!AK:AL,2,FALSE),\"Help!\"))","v":""},null,{"$f":"IF(BY3=\"\",\"\",BW3+IF(BY3=\"XX\",VLOOKUP(\"WRONG\",Answers!AK:AL,2,FALSE),BY3)+BZ3)","v":""},{"$f":"Mainframe!V2","v":0},{"$f":"IF(CB3=0,\"\",IF(NOT(ISNA(VLOOKUP(CB3,Answers!AM:AN,2,FALSE))),VLOOKUP(CB3,Answers!AM:AN,2,FALSE),\"Help!\"))","v":""},null,{"$f":"IF(CC3=\"\",\"\",CA3+IF(CC3=\"XX\",VLOOKUP(\"WRONG\",Answers!AM:AN,2,FALSE),CC3)+CD3)","v":""},null,null,{"$f":"IF(B3=0,\"\",IF(INDEX($B:$CE,ROW(),1)=0,\"\",IF(INDEX($B:$CE,ROW(),4*$CH$1+2)=INDEX($B:$CE,ROW()-1,4*$CH$1+2),$CH2,ROW()-2)))","v":""},{"$f":"IF(B3=0,\"\",CONCATENATE(\"[b]\",UPPER(INDEX($B:$CE,ROW(),$CH$1*4-1)),\" – \",IF(INDEX($B:$CE,ROW(),$CH$1*4)=1,\"Singleton![/b]\",CONCATENATE(INDEX($B:$CE,ROW(),$CH$1*4),\" responses[/b]\"))))","v":""},{"$f":"IF(INDEX($B:$CE,ROW(),1)=0,\"\",IF(INDEX($B:$CE,ROW(),$CH$1*4-1)=INDEX($B:$CE,ROW()+1,$CH$1*4-1),CONCATENATE(INDEX($B:$CE,ROW(),1),\"//\",INDEX($CJ:$CJ,ROW()+1,1)),INDEX($B:$CE,ROW(),1)))","v":""},{"$f":"IF(INDEX($B:$CE,ROW(),1)=0,\"\",IF(ISNUMBER(SEARCH(\"//\",INDEX($CJ:$CJ,ROW()-1,1))),\"No\",\"Yes\"))","v":""},{"$f":"IF(B3=0,\"\",CONCATENATE(INDEX($CH:$CL,ROW(),1), \". \", INDEX($B:$CE,ROW(),1), \" — [b]\", INDEX($B:$CE,ROW(),$CH$1*4+2),\"[/b] pts\"))","v":""}]
["[*]",{"$f":"Mainframe!B3","v":0},2,{"$f":"Mainframe!C3","v":0},{"$f":"IF(D4=0,\"\",IF(NOT(ISNA(VLOOKUP(D4,Answers!A:B,2,FALSE))),VLOOKUP(D4,Answers!A:B,2,FALSE),\"Help!\"))","v":""},null,{"$f":"IF(E4=\"\",\"\",IF(E4=\"XX\",VLOOKUP(\"WRONG\",Answers!A:B,2,FALSE),E4)+F4)","v":""},{"$f":"Mainframe!D3","v":0},{"$f":"IF(H4=0,\"\",IF(NOT(ISNA(VLOOKUP(H4,Answers!C:D,2,FALSE))),VLOOKUP(H4,Answers!C:D,2,FALSE),\"Help!\"))","v":""},null,{"$f":"IF(I4=\"\",\"\",G4+IF(I4=\"XX\",VLOOKUP(\"WRONG\",Answers!C:D,2,FALSE),I4)+J4)","v":""},{"$f":"Mainframe!E3","v":0},{"$f":"IF(L4=0,\"\",IF(NOT(ISNA(VLOOKUP(L4,Answers!E:F,2,FALSE))),VLOOKUP(L4,Answers!E:F,2,FALSE),\"Help!\"))","v":""},null,{"$f":"IF(M4=\"\",\"\",K4+IF(M4=\"XX\",VLOOKUP(\"WRONG\",Answers!E:F,2,FALSE),M4)+N4)","v":""},{"$f":"Mainframe!F3","v":0},{"$f":"IF(P4=0,\"\",IF(NOT(ISNA(VLOOKUP(P4,Answers!G:H,2,FALSE))),VLOOKUP(P4,Answers!G:H,2,FALSE),\"Help!\"))","v":""},null,{"$f":"IF(Q4=\"\",\"\",O4+IF(Q4=\"XX\",VLOOKUP(\"WRONG\",Answers!G:H,2,FALSE),Q4)+R4)","v":""},{"$f":"Mainframe!G3","v":0},{"$f":"IF(T4=0,\"\",IF(NOT(ISNA(VLOOKUP(T4,Answers!I:J,2,FALSE))),VLOOKUP(T4,Answers!I:J,2,FALSE),\"Help!\"))","v":""},null,{"$f":"IF(U4=\"\",\"\",S4+IF(U4=\"XX\",VLOOKUP(\"WRONG\",Answers!I:J,2,FALSE),U4)+V4)","v":""},{"$f":"Mainframe!H3","v":0},{"$f":"IF(X4=0,\"\",IF(NOT(ISNA(VLOOKUP(X4,Answers!K:L,2,FALSE))),VLOOKUP(X4,Answers!K:L,2,FALSE),\"Help!\"))","v":""},null,{"$f":"IF(Y4=\"\",\"\",W4+IF(Y4=\"XX\",VLOOKUP(\"WRONG\",Answers!K:L,2,FALSE),Y4)+Z4)","v":""},{"$f":"Mainframe!I3","v":0},{"$f":"IF(AB4=0,\"\",IF(NOT(ISNA(VLOOKUP(AB4,Answers!M:N,2,FALSE))),VLOOKUP(AB4,Answers!M:N,2,FALSE),\"Help!\"))","v":""},null,{"$f":"IF(AC4=\"\",\"\",AA4+IF(AC4=\"XX\",VLOOKUP(\"WRONG\",Answers!M:N,2,FALSE),AC4)+AD4)","v":""},{"$f":"Mainframe!J3","v":0},{"$f":"IF(AF4=0,\"\",IF(NOT(ISNA(VLOOKUP(AF4,Answers!O:P,2,FALSE))),VLOOKUP(AF4,Answers!O:P,2,FALSE),\"Help!\"))","v":""},null,{"$f":"IF(AG4=\"\",\"\",AE4+IF(AG4=\"XX\",VLOOKUP(\"WRONG\",Answers!O:P,2,FALSE),AG4)+AH4)","v":""},{"$f":"Mainframe!K3","v":0},{"$f":"IF(AJ4=0,\"\",IF(NOT(ISNA(VLOOKUP(AJ4,Answers!Q:R,2,FALSE))),VLOOKUP(AJ4,Answers!Q:R,2,FALSE),\"Help!\"))","v":""},null,{"$f":"IF(AK4=\"\",\"\",AI4+IF(AK4=\"XX\",VLOOKUP(\"WRONG\",Answers!Q:R,2,FALSE),AK4)+AL4)","v":""},{"$f":"Mainframe!L3","v":0},{"$f":"IF(AN4=0,\"\",IF(NOT(ISNA(VLOOKUP(AN4,Answers!S:T,2,FALSE))),VLOOKUP(AN4,Answers!S:T,2,FALSE),\"Help!\"))","v":""},null,{"$f":"IF(AO4=\"\",\"\",AM4+IF(AO4=\"XX\",VLOOKUP(\"WRONG\",Answers!S:T,2,FALSE),AO4)+AP4)","v":""},{"$f":"Mainframe!M3","v":0},{"$f":"IF(AR4=0,\"\",IF(NOT(ISNA(VLOOKUP(AR4,Answers!U:V,2,FALSE))),VLOOKUP(AR4,Answers!U:V,2,FALSE),\"Help!\"))","v":""},null,{"$f":"IF(AS4=\"\",\"\",AQ4+IF(AS4=\"XX\",VLOOKUP(\"WRONG\",Answers!U:V,2,FALSE),AS4)+AT4)","v":""},{"$f":"Mainframe!N3","v":0},{"$f":"IF(AV4=0,\"\",IF(NOT(ISNA(VLOOKUP(AV4,Answers!W:X,2,FALSE))),VLOOKUP(AV4,Answers!W:X,2,FALSE),\"Help!\"))","v":""},null,{"$f":"IF(AW4=\"\",\"\",AU4+IF(AW4=\"XX\",VLOOKUP(\"WRONG\",Answers!W:X,2,FALSE),AW4)+AX4)","v":""},{"$f":"Mainframe!O3","v":0},{"$f":"IF(AZ4=0,\"\",IF(NOT(ISNA(VLOOKUP(AZ4,Answers!Y:Z,2,FALSE))),VLOOKUP(AZ4,Answers!Y:Z,2,FALSE),\"Help!\"))","v":""},null,{"$f":"IF(BA4=\"\",\"\",AY4+IF(BA4=\"XX\",VLOOKUP(\"WRONG\",Answers!Y:Z,2,FALSE),BA4)+BB4)","v":""},{"$f":"Mainframe!P3","v":0},{"$f":"IF(BD4=0,\"\",IF(NOT(ISNA(VLOOKUP(BD4,Answers!AA:AB,2,FALSE))),VLOOKUP(BD4,Answers!AA:AB,2,FALSE),\"Help!\"))","v":""},null,{"$f":"IF(BE4=\"\",\"\",BC4+IF(BE4=\"XX\",VLOOKUP(\"WRONG\",Answers!AA:AB,2,FALSE),BE4)+BF4)","v":""},{"$f":"Mainframe!Q3","v":0},{"$f":"IF(BH4=0,\"\",IF(NOT(ISNA(VLOOKUP(BH4,Answers!AC:AD,2,FALSE))),VLOOKUP(BH4,Answers!AC:AD,2,FALSE),\"Help!\"))","v":""},null,{"$f":"IF(BI4=\"\",\"\",BG4+IF(BI4=\"XX\",VLOOKUP(\"WRONG\",Answers!AC:AD,2,FALSE),BI4)+BJ4)","v":""},{"$f":"Mainframe!R3","v":0},{"$f":"IF(BL4=0,\"\",IF(NOT(ISNA(VLOOKUP(BL4,Answers!AE:AF,2,FALSE))),VLOOKUP(BL4,Answers!AE:AF,2,FALSE),\"Help!\"))","v":""},null,{"$f":"IF(BM4=\"\",\"\",BK4+IF(BM4=\"XX\",VLOOKUP(\"WRONG\",Answers!AE:AF,2,FALSE),BM4)+BN4)","v":""},{"$f":"Mainframe!S3","v":0},{"$f":"IF(BP4=0,\"\",IF(NOT(ISNA(VLOOKUP(BP4,Answers!AG:AH,2,FALSE))),VLOOKUP(BP4,Answers!AG:AH,2,FALSE),\"Help!\"))","v":""},null,{"$f":"IF(BQ4=\"\",\"\",BO4+IF(BQ4=\"XX\",VLOOKUP(\"WRONG\",Answers!AG:AH,2,FALSE),BQ4)+BR4)","v":""},{"$f":"Mainframe!T3","v":0},{"$f":"IF(BT4=0,\"\",IF(NOT(ISNA(VLOOKUP(BT4,Answers!AI:AJ,2,FALSE))),VLOOKUP(BT4,Answers!AI:AJ,2,FALSE),\"Help!\"))","v":""},null,{"$f":"IF(BU4=\"\",\"\",BS4+IF(BU4=\"XX\",VLOOKUP(\"WRONG\",Answers!AI:AJ,2,FALSE),BU4)+BV4)","v":""},{"$f":"Mainframe!U3","v":0},{"$f":"IF(BX4=0,\"\",IF(NOT(ISNA(VLOOKUP(BX4,Answers!AK:AL,2,FALSE))),VLOOKUP(BX4,Answers!AK:AL,2,FALSE),\"Help!\"))","v":""},null,{"$f":"IF(BY4=\"\",\"\",BW4+IF(BY4=\"XX\",VLOOKUP(\"WRONG\",Answers!AK:AL,2,FALSE),BY4)+BZ4)","v":""},{"$f":"Mainframe!V3","v":0},{"$f":"IF(CB4=0,\"\",IF(NOT(ISNA(VLOOKUP(CB4,Answers!AM:AN,2,FALSE))),VLOOKUP(CB4,Answers!AM:AN,2,FALSE),\"Help!\"))","v":""},null,{"$f":"IF(CC4=\"\",\"\",CA4+IF(CC4=\"XX\",VLOOKUP(\"WRONG\",Answers!AM:AN,2,FALSE),CC4)+CD4)","v":""},null,null,"",{"$f":"IF(B4=0,\"\",CONCATENATE(\"[b]\",UPPER(INDEX($B:$CE,ROW(),$CH$1*4-1)),\" – \",IF(INDEX($B:$CE,ROW(),$CH$1*4)=1,\"Singleton![/b]\",CONCATENATE(INDEX($B:$CE,ROW(),$CH$1*4),\" responses[/b]\"))))","v":""},{"$f":"IF(INDEX($B:$CE,ROW(),1)=0,\"\",IF(INDEX($B:$CE,ROW(),$CH$1*4-1)=INDEX($B:$CE,ROW()+1,$CH$1*4-1),CONCATENATE(INDEX($B:$CE,ROW(),1),\"//\",INDEX($CJ:$CJ,ROW()+1,1)),INDEX($B:$CE,ROW(),1)))","v":""},{"$f":"IF(INDEX($B:$CE,ROW(),1)=0,\"\",IF(ISNUMBER(SEARCH(\"//\",INDEX($CJ:$CJ,ROW()-1,1))),\"No\",\"Yes\"))","v":""},""]
["[*]",{"$f":"Mainframe!B4","v":0},3,{"$f":"Mainframe!C4","v":0},{"$f":"IF(D5=0,\"\",IF(NOT(ISNA(VLOOKUP(D5,Answers!A:B,2,FALSE))),VLOOKUP(D5,Answers!A:B,2,FALSE),\"Help!\"))","v":""},null,{"$f":"IF(E5=\"\",\"\",IF(E5=\"XX\",VLOOKUP(\"WRONG\",Answers!A:B,2,FALSE),E5)+F5)","v":""},{"$f":"Mainframe!D4","v":0},{"$f":"IF(H5=0,\"\",IF(NOT(ISNA(VLOOKUP(H5,Answers!C:D,2,FALSE))),VLOOKUP(H5,Answers!C:D,2,FALSE),\"Help!\"))","v":""},null,{"$f":"IF(I5=\"\",\"\",G5+IF(I5=\"XX\",VLOOKUP(\"WRONG\",Answers!C:D,2,FALSE),I5)+J5)","v":""},{"$f":"Mainframe!E4","v":0},{"$f":"IF(L5=0,\"\",IF(NOT(ISNA(VLOOKUP(L5,Answers!E:F,2,FALSE))),VLOOKUP(L5,Answers!E:F,2,FALSE),\"Help!\"))","v":""},null,{"$f":"IF(M5=\"\",\"\",K5+IF(M5=\"XX\",VLOOKUP(\"WRONG\",Answers!E:F,2,FALSE),M5)+N5)","v":""},{"$f":"Mainframe!F4","v":0},{"$f":"IF(P5=0,\"\",IF(NOT(ISNA(VLOOKUP(P5,Answers!G:H,2,FALSE))),VLOOKUP(P5,Answers!G:H,2,FALSE),\"Help!\"))","v":""},null,{"$f":"IF(Q5=\"\",\"\",O5+IF(Q5=\"XX\",VLOOKUP(\"WRONG\",Answers!G:H,2,FALSE),Q5)+R5)","v":""},{"$f":"Mainframe!G4","v":0},{"$f":"IF(T5=0,\"\",IF(NOT(ISNA(VLOOKUP(T5,Answers!I:J,2,FALSE))),VLOOKUP(T5,Answers!I:J,2,FALSE),\"Help!\"))","v":""},null,{"$f":"IF(U5=\"\",\"\",S5+IF(U5=\"XX\",VLOOKUP(\"WRONG\",Answers!I:J,2,FALSE),U5)+V5)","v":""},{"$f":"Mainframe!H4","v":0},{"$f":"IF(X5=0,\"\",IF(NOT(ISNA(VLOOKUP(X5,Answers!K:L,2,FALSE))),VLOOKUP(X5,Answers!K:L,2,FALSE),\"Help!\"))","v":""},null,{"$f":"IF(Y5=\"\",\"\",W5+IF(Y5=\"XX\",VLOOKUP(\"WRONG\",Answers!K:L,2,FALSE),Y5)+Z5)","v":""},{"$f":"Mainframe!I4","v":0},{"$f":"IF(AB5=0,\"\",IF(NOT(ISNA(VLOOKUP(AB5,Answers!M:N,2,FALSE))),VLOOKUP(AB5,Answers!M:N,2,FALSE),\"Help!\"))","v":""},null,{"$f":"IF(AC5=\"\",\"\",AA5+IF(AC5=\"XX\",VLOOKUP(\"WRONG\",Answers!M:N,2,FALSE),AC5)+AD5)","v":""},{"$f":"Mainframe!J4","v":0},{"$f":"IF(AF5=0,\"\",IF(NOT(ISNA(VLOOKUP(AF5,Answers!O:P,2,FALSE))),VLOOKUP(AF5,Answers!O:P,2,FALSE),\"Help!\"))","v":""},null,{"$f":"IF(AG5=\"\",\"\",AE5+IF(AG5=\"XX\",VLOOKUP(\"WRONG\",Answers!O:P,2,FALSE),AG5)+AH5)","v":""},{"$f":"Mainframe!K4","v":0},{"$f":"IF(AJ5=0,\"\",IF(NOT(ISNA(VLOOKUP(AJ5,Answers!Q:R,2,FALSE))),VLOOKUP(AJ5,Answers!Q:R,2,FALSE),\"Help!\"))","v":""},null,{"$f":"IF(AK5=\"\",\"\",AI5+IF(AK5=\"XX\",VLOOKUP(\"WRONG\",Answers!Q:R,2,FALSE),AK5)+AL5)","v":""},{"$f":"Mainframe!L4","v":0},{"$f":"IF(AN5=0,\"\",IF(NOT(ISNA(VLOOKUP(AN5,Answers!S:T,2,FALSE))),VLOOKUP(AN5,Answers!S:T,2,FALSE),\"Help!\"))","v":""},null,{"$f":"IF(AO5=\"\",\"\",AM5+IF(AO5=\"XX\",VLOOKUP(\"WRONG\",Answers!S:T,2,FALSE),AO5)+AP5)","v":""},{"$f":"Mainframe!M4","v":0},{"$f":"IF(AR5=0,\"\",IF(NOT(ISNA(VLOOKUP(AR5,Answers!U:V,2,FALSE))),VLOOKUP(AR5,Answers!U:V,2,FALSE),\"Help!\"))","v":""},null,{"$f":"IF(AS5=\"\",\"\",AQ5+IF(AS5=\"XX\",VLOOKUP(\"WRONG\",Answers!U:V,2,FALSE),AS5)+AT5)","v":""},{"$f":"Mainframe!N4","v":0},{"$f":"IF(AV5=0,\"\",IF(NOT(ISNA(VLOOKUP(AV5,Answers!W:X,2,FALSE))),VLOOKUP(AV5,Answers!W:X,2,FALSE),\"Help!\"))","v":""},null,{"$f":"IF(AW5=\"\",\"\",AU5+IF(AW5=\"XX\",VLOOKUP(\"WRONG\",Answers!W:X,2,FALSE),AW5)+AX5)","v":""},{"$f":"Mainframe!O4","v":0},{"$f":"IF(AZ5=0,\"\",IF(NOT(ISNA(VLOOKUP(AZ5,Answers!Y:Z,2,FALSE))),VLOOKUP(AZ5,Answers!Y:Z,2,FALSE),\"Help!\"))","v":""},null,{"$f":"IF(BA5=\"\",\"\",AY5+IF(BA5=\"XX\",VLOOKUP(\"WRONG\",Answers!Y:Z,2,FALSE),BA5)+BB5)","v":""},{"$f":"Mainframe!P4","v":0},{"$f":"IF(BD5=0,\"\",IF(NOT(ISNA(VLOOKUP(BD5,Answers!AA:AB,2,FALSE))),VLOOKUP(BD5,Answers!AA:AB,2,FALSE),\"Help!\"))","v":""},null,{"$f":"IF(BE5=\"\",\"\",BC5+IF(BE5=\"XX\",VLOOKUP(\"WRONG\",Answers!AA:AB,2,FALSE),BE5)+BF5)","v":""},{"$f":"Mainframe!Q4","v":0},{"$f":"IF(BH5=0,\"\",IF(NOT(ISNA(VLOOKUP(BH5,Answers!AC:AD,2,FALSE))),VLOOKUP(BH5,Answers!AC:AD,2,FALSE),\"Help!\"))","v":""},null,{"$f":"IF(BI5=\"\",\"\",BG5+IF(BI5=\"XX\",VLOOKUP(\"WRONG\",Answers!AC:AD,2,FALSE),BI5)+BJ5)","v":""},{"$f":"Mainframe!R4","v":0},{"$f":"IF(BL5=0,\"\",IF(NOT(ISNA(VLOOKUP(BL5,Answers!AE:AF,2,FALSE))),VLOOKUP(BL5,Answers!AE:AF,2,FALSE),\"Help!\"))","v":""},null,{"$f":"IF(BM5=\"\",\"\",BK5+IF(BM5=\"XX\",VLOOKUP(\"WRONG\",Answers!AE:AF,2,FALSE),BM5)+BN5)","v":""},{"$f":"Mainframe!S4","v":0},{"$f":"IF(BP5=0,\"\",IF(NOT(ISNA(VLOOKUP(BP5,Answers!AG:AH,2,FALSE))),VLOOKUP(BP5,Answers!AG:AH,2,FALSE),\"Help!\"))","v":""},null,{"$f":"IF(BQ5=\"\",\"\",BO5+IF(BQ5=\"XX\",VLOOKUP(\"WRONG\",Answers!AG:AH,2,FALSE),BQ5)+BR5)","v":""},{"$f":"Mainframe!T4","v":0},{"$f":"IF(BT5=0,\"\",IF(NOT(ISNA(VLOOKUP(BT5,Answers!AI:AJ,2,FALSE))),VLOOKUP(BT5,Answers!AI:AJ,2,FALSE),\"Help!\"))","v":""},null,{"$f":"IF(BU5=\"\",\"\",BS5+IF(BU5=\"XX\",VLOOKUP(\"WRONG\",Answers!AI:AJ,2,FALSE),BU5)+BV5)","v":""},{"$f":"Mainframe!U4","v":0},{"$f":"IF(BX5=0,\"\",IF(NOT(ISNA(VLOOKUP(BX5,Answers!AK:AL,2,FALSE))),VLOOKUP(BX5,Answers!AK:AL,2,FALSE),\"Help!\"))","v":""},null,{"$f":"IF(BY5=\"\",\"\",BW5+IF(BY5=\"XX\",VLOOKUP(\"WRONG\",Answers!AK:AL,2,FALSE),BY5)+BZ5)","v":""},{"$f":"Mainframe!V4","v":0},{"$f":"IF(CB5=0,\"\",IF(NOT(ISNA(VLOOKUP(CB5,Answers!AM:AN,2,FALSE))),VLOOKUP(CB5,Answers!AM:AN,2,FALSE),\"Help!\"))","v":""},null,{"$f":"IF(CC5=\"\",\"\",CA5+IF(CC5=\"XX\",VLOOKUP(\"WRONG\",Answers!AM:AN,2,FALSE),CC5)+CD5)","v":""},null,null,"","","","",""]
["[*]",{"$f":"Mainframe!B5","v":0},4,{"$f":"Mainframe!C5","v":0},{"$f":"IF(D6=0,\"\",IF(NOT(ISNA(VLOOKUP(D6,Answers!A:B,2,FALSE))),VLOOKUP(D6,Answers!A:B,2,FALSE),\"Help!\"))","v":""},null,{"$f":"IF(E6=\"\",\"\",IF(E6=\"XX\",VLOOKUP(\"WRONG\",Answers!A:B,2,FALSE),E6)+F6)","v":""},{"$f":"Mainframe!D5","v":0},{"$f":"IF(H6=0,\"\",IF(NOT(ISNA(VLOOKUP(H6,Answers!C:D,2,FALSE))),VLOOKUP(H6,Answers!C:D,2,FALSE),\"Help!\"))","v":""},null,{"$f":"IF(I6=\"\",\"\",G6+IF(I6=\"XX\",VLOOKUP(\"WRONG\",Answers!C:D,2,FALSE),I6)+J6)","v":""},{"$f":"Mainframe!E5","v":0},{"$f":"IF(L6=0,\"\",IF(NOT(ISNA(VLOOKUP(L6,Answers!E:F,2,FALSE))),VLOOKUP(L6,Answers!E:F,2,FALSE),\"Help!\"))","v":""},null,{"$f":"IF(M6=\"\",\"\",K6+IF(M6=\"XX\",VLOOKUP(\"WRONG\",Answers!E:F,2,FALSE),M6)+N6)","v":""},{"$f":"Mainframe!F5","v":0},{"$f":"IF(P6=0,\"\",IF(NOT(ISNA(VLOOKUP(P6,Answers!G:H,2,FALSE))),VLOOKUP(P6,Answers!G:H,2,FALSE),\"Help!\"))","v":""},null,{"$f":"IF(Q6=\"\",\"\",O6+IF(Q6=\"XX\",VLOOKUP(\"WRONG\",Answers!G:H,2,FALSE),Q6)+R6)","v":""},{"$f":"Mainframe!G5","v":0},{"$f":"IF(T6=0,\"\",IF(NOT(ISNA(VLOOKUP(T6,Answers!I:J,2,FALSE))),VLOOKUP(T6,Answers!I:J,2,FALSE),\"Help!\"))","v":""},null,{"$f":"IF(U6=\"\",\"\",S6+IF(U6=\"XX\",VLOOKUP(\"WRONG\",Answers!I:J,2,FALSE),U6)+V6)","v":""},{"$f":"Mainframe!H5","v":0},{"$f":"IF(X6=0,\"\",IF(NOT(ISNA(VLOOKUP(X6,Answers!K:L,2,FALSE))),VLOOKUP(X6,Answers!K:L,2,FALSE),\"Help!\"))","v":""},null,{"$f":"IF(Y6=\"\",\"\",W6+IF(Y6=\"XX\",VLOOKUP(\"WRONG\",Answers!K:L,2,FALSE),Y6)+Z6)","v":""},{"$f":"Mainframe!I5","v":0},{"$f":"IF(AB6=0,\"\",IF(NOT(ISNA(VLOOKUP(AB6,Answers!M:N,2,FALSE))),VLOOKUP(AB6,Answers!M:N,2,FALSE),\"Help!\"))","v":""},null,{"$f":"IF(AC6=\"\",\"\",AA6+IF(AC6=\"XX\",VLOOKUP(\"WRONG\",Answers!M:N,2,FALSE),AC6)+AD6)","v":""},{"$f":"Mainframe!J5","v":0},{"$f":"IF(AF6=0,\"\",IF(NOT(ISNA(VLOOKUP(AF6,Answers!O:P,2,FALSE))),VLOOKUP(AF6,Answers!O:P,2,FALSE),\"Help!\"))","v":""},null,{"$f":"IF(AG6=\"\",\"\",AE6+IF(AG6=\"XX\",VLOOKUP(\"WRONG\",Answers!O:P,2,FALSE),AG6)+AH6)","v":""},{"$f":"Mainframe!K5","v":0},{"$f":"IF(AJ6=0,\"\",IF(NOT(ISNA(VLOOKUP(AJ6,Answers!Q:R,2,FALSE))),VLOOKUP(AJ6,Answers!Q:R,2,FALSE),\"Help!\"))","v":""},null,{"$f":"IF(AK6=\"\",\"\",AI6+IF(AK6=\"XX\",VLOOKUP(\"WRONG\",Answers!Q:R,2,FALSE),AK6)+AL6)","v":""},{"$f":"Mainframe!L5","v":0},{"$f":"IF(AN6=0,\"\",IF(NOT(ISNA(VLOOKUP(AN6,Answers!S:T,2,FALSE))),VLOOKUP(AN6,Answers!S:T,2,FALSE),\"Help!\"))","v":""},null,{"$f":"IF(AO6=\"\",\"\",AM6+IF(AO6=\"XX\",VLOOKUP(\"WRONG\",Answers!S:T,2,FALSE),AO6)+AP6)","v":""},{"$f":"Mainframe!M5","v":0},{"$f":"IF(AR6=0,\"\",IF(NOT(ISNA(VLOOKUP(AR6,Answers!U:V,2,FALSE))),VLOOKUP(AR6,Answers!U:V,2,FALSE),\"Help!\"))","v":""},null,{"$f":"IF(AS6=\"\",\"\",AQ6+IF(AS6=\"XX\",VLOOKUP(\"WRONG\",Answers!U:V,2,FALSE),AS6)+AT6)","v":""},{"$f":"Mainframe!N5","v":0},{"$f":"IF(AV6=0,\"\",IF(NOT(ISNA(VLOOKUP(AV6,Answers!W:X,2,FALSE))),VLOOKUP(AV6,Answers!W:X,2,FALSE),\"Help!\"))","v":""},null,{"$f":"IF(AW6=\"\",\"\",AU6+IF(AW6=\"XX\",VLOOKUP(\"WRONG\",Answers!W:X,2,FALSE),AW6)+AX6)","v":""},{"$f":"Mainframe!O5","v":0},{"$f":"IF(AZ6=0,\"\",IF(NOT(ISNA(VLOOKUP(AZ6,Answers!Y:Z,2,FALSE))),VLOOKUP(AZ6,Answers!Y:Z,2,FALSE),\"Help!\"))","v":""},null,{"$f":"IF(BA6=\"\",\"\",AY6+IF(BA6=\"XX\",VLOOKUP(\"WRONG\",Answers!Y:Z,2,FALSE),BA6)+BB6)","v":""},{"$f":"Mainframe!P5","v":0},{"$f":"IF(BD6=0,\"\",IF(NOT(ISNA(VLOOKUP(BD6,Answers!AA:AB,2,FALSE))),VLOOKUP(BD6,Answers!AA:AB,2,FALSE),\"Help!\"))","v":""},null,{"$f":"IF(BE6=\"\",\"\",BC6+IF(BE6=\"XX\",VLOOKUP(\"WRONG\",Answers!AA:AB,2,FALSE),BE6)+BF6)","v":""},{"$f":"Mainframe!Q5","v":0},{"$f":"IF(BH6=0,\"\",IF(NOT(ISNA(VLOOKUP(BH6,Answers!AC:AD,2,FALSE))),VLOOKUP(BH6,Answers!AC:AD,2,FALSE),\"Help!\"))","v":""},null,{"$f":"IF(BI6=\"\",\"\",BG6+IF(BI6=\"XX\",VLOOKUP(\"WRONG\",Answers!AC:AD,2,FALSE),BI6)+BJ6)","v":""},{"$f":"Mainframe!R5","v":0},{"$f":"IF(BL6=0,\"\",IF(NOT(ISNA(VLOOKUP(BL6,Answers!AE:AF,2,FALSE))),VLOOKUP(BL6,Answers!AE:AF,2,FALSE),\"Help!\"))","v":""},null,{"$f":"IF(BM6=\"\",\"\",BK6+IF(BM6=\"XX\",VLOOKUP(\"WRONG\",Answers!AE:AF,2,FALSE),BM6)+BN6)","v":""},{"$f":"Mainframe!S5","v":0},{"$f":"IF(BP6=0,\"\",IF(NOT(ISNA(VLOOKUP(BP6,Answers!AG:AH,2,FALSE))),VLOOKUP(BP6,Answers!AG:AH,2,FALSE),\"Help!\"))","v":""},null,{"$f":"IF(BQ6=\"\",\"\",BO6+IF(BQ6=\"XX\",VLOOKUP(\"WRONG\",Answers!AG:AH,2,FALSE),BQ6)+BR6)","v":""},{"$f":"Mainframe!T5","v":0},{"$f":"IF(BT6=0,\"\",IF(NOT(ISNA(VLOOKUP(BT6,Answers!AI:AJ,2,FALSE))),VLOOKUP(BT6,Answers!AI:AJ,2,FALSE),\"Help!\"))","v":""},null,{"$f":"IF(BU6=\"\",\"\",BS6+IF(BU6=\"XX\",VLOOKUP(\"WRONG\",Answers!AI:AJ,2,FALSE),BU6)+BV6)","v":""},{"$f":"Mainframe!U5","v":0},{"$f":"IF(BX6=0,\"\",IF(NOT(ISNA(VLOOKUP(BX6,Answers!AK:AL,2,FALSE))),VLOOKUP(BX6,Answers!AK:AL,2,FALSE),\"Help!\"))","v":""},null,{"$f":"IF(BY6=\"\",\"\",BW6+IF(BY6=\"XX\",VLOOKUP(\"WRONG\",Answers!AK:AL,2,FALSE),BY6)+BZ6)","v":""},{"$f":"Mainframe!V5","v":0},{"$f":"IF(CB6=0,\"\",IF(NOT(ISNA(VLOOKUP(CB6,Answers!AM:AN,2,FALSE))),VLOOKUP(CB6,Answers!AM:AN,2,FALSE),\"Help!\"))","v":""},null,{"$f":"IF(CC6=\"\",\"\",CA6+IF(CC6=\"XX\",VLOOKUP(\"WRONG\",Answers!AM:AN,2,FALSE),CC6)+CD6)","v":""},null,null,"","","","",""]
["[*]",{"$f":"Mainframe!B6","v":0},5,{"$f":"Mainframe!C6","v":0},{"$f":"IF(D7=0,\"\",IF(NOT(ISNA(VLOOKUP(D7,Answers!A:B,2,FALSE))),VLOOKUP(D7,Answers!A:B,2,FALSE),\"Help!\"))","v":""},null,{"$f":"IF(E7=\"\",\"\",IF(E7=\"XX\",VLOOKUP(\"WRONG\",Answers!A:B,2,FALSE),E7)+F7)","v":""},{"$f":"Mainframe!D6","v":0},{"$f":"IF(H7=0,\"\",IF(NOT(ISNA(VLOOKUP(H7,Answers!C:D,2,FALSE))),VLOOKUP(H7,Answers!C:D,2,FALSE),\"Help!\"))","v":""},null,{"$f":"IF(I7=\"\",\"\",G7+IF(I7=\"XX\",VLOOKUP(\"WRONG\",Answers!C:D,2,FALSE),I7)+J7)","v":""},{"$f":"Mainframe!E6","v":0},{"$f":"IF(L7=0,\"\",IF(NOT(ISNA(VLOOKUP(L7,Answers!E:F,2,FALSE))),VLOOKUP(L7,Answers!E:F,2,FALSE),\"Help!\"))","v":""},null,{"$f":"IF(M7=\"\",\"\",K7+IF(M7=\"XX\",VLOOKUP(\"WRONG\",Answers!E:F,2,FALSE),M7)+N7)","v":""},{"$f":"Mainframe!F6","v":0},{"$f":"IF(P7=0,\"\",IF(NOT(ISNA(VLOOKUP(P7,Answers!G:H,2,FALSE))),VLOOKUP(P7,Answers!G:H,2,FALSE),\"Help!\"))","v":""},null,{"$f":"IF(Q7=\"\",\"\",O7+IF(Q7=\"XX\",VLOOKUP(\"WRONG\",Answers!G:H,2,FALSE),Q7)+R7)","v":""},{"$f":"Mainframe!G6","v":0},{"$f":"IF(T7=0,\"\",IF(NOT(ISNA(VLOOKUP(T7,Answers!I:J,2,FALSE))),VLOOKUP(T7,Answers!I:J,2,FALSE),\"Help!\"))","v":""},null,{"$f":"IF(U7=\"\",\"\",S7+IF(U7=\"XX\",VLOOKUP(\"WRONG\",Answers!I:J,2,FALSE),U7)+V7)","v":""},{"$f":"Mainframe!H6","v":0},{"$f":"IF(X7=0,\"\",IF(NOT(ISNA(VLOOKUP(X7,Answers!K:L,2,FALSE))),VLOOKUP(X7,Answers!K:L,2,FALSE),\"Help!\"))","v":""},null,{"$f":"IF(Y7=\"\",\"\",W7+IF(Y7=\"XX\",VLOOKUP(\"WRONG\",Answers!K:L,2,FALSE),Y7)+Z7)","v":""},{"$f":"Mainframe!I6","v":0},{"$f":"IF(AB7=0,\"\",IF(NOT(ISNA(VLOOKUP(AB7,Answers!M:N,2,FALSE))),VLOOKUP(AB7,Answers!M:N,2,FALSE),\"Help!\"))","v":""},null,{"$f":"IF(AC7=\"\",\"\",AA7+IF(AC7=\"XX\",VLOOKUP(\"WRONG\",Answers!M:N,2,FALSE),AC7)+AD7)","v":""},{"$f":"Mainframe!J6","v":0},{"$f":"IF(AF7=0,\"\",IF(NOT(ISNA(VLOOKUP(AF7,Answers!O:P,2,FALSE))),VLOOKUP(AF7,Answers!O:P,2,FALSE),\"Help!\"))","v":""},null,{"$f":"IF(AG7=\"\",\"\",AE7+IF(AG7=\"XX\",VLOOKUP(\"WRONG\",Answers!O:P,2,FALSE),AG7)+AH7)","v":""},{"$f":"Mainframe!K6","v":0},{"$f":"IF(AJ7=0,\"\",IF(NOT(ISNA(VLOOKUP(AJ7,Answers!Q:R,2,FALSE))),VLOOKUP(AJ7,Answers!Q:R,2,FALSE),\"Help!\"))","v":""},null,{"$f":"IF(AK7=\"\",\"\",AI7+IF(AK7=\"XX\",VLOOKUP(\"WRONG\",Answers!Q:R,2,FALSE),AK7)+AL7)","v":""},{"$f":"Mainframe!L6","v":0},{"$f":"IF(AN7=0,\"\",IF(NOT(ISNA(VLOOKUP(AN7,Answers!S:T,2,FALSE))),VLOOKUP(AN7,Answers!S:T,2,FALSE),\"Help!\"))","v":""},null,{"$f":"IF(AO7=\"\",\"\",AM7+IF(AO7=\"XX\",VLOOKUP(\"WRONG\",Answers!S:T,2,FALSE),AO7)+AP7)","v":""},{"$f":"Mainframe!M6","v":0},{"$f":"IF(AR7=0,\"\",IF(NOT(ISNA(VLOOKUP(AR7,Answers!U:V,2,FALSE))),VLOOKUP(AR7,Answers!U:V,2,FALSE),\"Help!\"))","v":""},null,{"$f":"IF(AS7=\"\",\"\",AQ7+IF(AS7=\"XX\",VLOOKUP(\"WRONG\",Answers!U:V,2,FALSE),AS7)+AT7)","v":""},{"$f":"Mainframe!N6","v":0},{"$f":"IF(AV7=0,\"\",IF(NOT(ISNA(VLOOKUP(AV7,Answers!W:X,2,FALSE))),VLOOKUP(AV7,Answers!W:X,2,FALSE),\"Help!\"))","v":""},null,{"$f":"IF(AW7=\"\",\"\",AU7+IF(AW7=\"XX\",VLOOKUP(\"WRONG\",Answers!W:X,2,FALSE),AW7)+AX7)","v":""},{"$f":"Mainframe!O6","v":0},{"$f":"IF(AZ7=0,\"\",IF(NOT(ISNA(VLOOKUP(AZ7,Answers!Y:Z,2,FALSE))),VLOOKUP(AZ7,Answers!Y:Z,2,FALSE),\"Help!\"))","v":""},null,{"$f":"IF(BA7=\"\",\"\",AY7+IF(BA7=\"XX\",VLOOKUP(\"WRONG\",Answers!Y:Z,2,FALSE),BA7)+BB7)","v":""},{"$f":"Mainframe!P6","v":0},{"$f":"IF(BD7=0,\"\",IF(NOT(ISNA(VLOOKUP(BD7,Answers!AA:AB,2,FALSE))),VLOOKUP(BD7,Answers!AA:AB,2,FALSE),\"Help!\"))","v":""},null,{"$f":"IF(BE7=\"\",\"\",BC7+IF(BE7=\"XX\",VLOOKUP(\"WRONG\",Answers!AA:AB,2,FALSE),BE7)+BF7)","v":""},{"$f":"Mainframe!Q6","v":0},{"$f":"IF(BH7=0,\"\",IF(NOT(ISNA(VLOOKUP(BH7,Answers!AC:AD,2,FALSE))),VLOOKUP(BH7,Answers!AC:AD,2,FALSE),\"Help!\"))","v":""},null,{"$f":"IF(BI7=\"\",\"\",BG7+IF(BI7=\"XX\",VLOOKUP(\"WRONG\",Answers!AC:AD,2,FALSE),BI7)+BJ7)","v":""},{"$f":"Mainframe!R6","v":0},{"$f":"IF(BL7=0,\"\",IF(NOT(ISNA(VLOOKUP(BL7,Answers!AE:AF,2,FALSE))),VLOOKUP(BL7,Answers!AE:AF,2,FALSE),\"Help!\"))","v":""},null,{"$f":"IF(BM7=\"\",\"\",BK7+IF(BM7=\"XX\",VLOOKUP(\"WRONG\",Answers!AE:AF,2,FALSE),BM7)+BN7)","v":""},{"$f":"Mainframe!S6","v":0},{"$f":"IF(BP7=0,\"\",IF(NOT(ISNA(VLOOKUP(BP7,Answers!AG:AH,2,FALSE))),VLOOKUP(BP7,Answers!AG:AH,2,FALSE),\"Help!\"))","v":""},null,{"$f":"IF(BQ7=\"\",\"\",BO7+IF(BQ7=\"XX\",VLOOKUP(\"WRONG\",Answers!AG:AH,2,FALSE),BQ7)+BR7)","v":""},{"$f":"Mainframe!T6","v":0},{"$f":"IF(BT7=0,\"\",IF(NOT(ISNA(VLOOKUP(BT7,Answers!AI:AJ,2,FALSE))),VLOOKUP(BT7,Answers!AI:AJ,2,FALSE),\"Help!\"))","v":""},null,{"$f":"IF(BU7=\"\",\"\",BS7+IF(BU7=\"XX\",VLOOKUP(\"WRONG\",Answers!AI:AJ,2,FALSE),BU7)+BV7)","v":""},{"$f":"Mainframe!U6","v":0},{"$f":"IF(BX7=0,\"\",IF(NOT(ISNA(VLOOKUP(BX7,Answers!AK:AL,2,FALSE))),VLOOKUP(BX7,Answers!AK:AL,2,FALSE),\"Help!\"))","v":""},null,{"$f":"IF(BY7=\"\",\"\",BW7+IF(BY7=\"XX\",VLOOKUP(\"WRONG\",Answers!AK:AL,2,FALSE),BY7)+BZ7)","v":""},{"$f":"Mainframe!V6","v":0},{"$f":"IF(CB7=0,\"\",IF(NOT(ISNA(VLOOKUP(CB7,Answers!AM:AN,2,FALSE))),VLOOKUP(CB7,Answers!AM:AN,2,FALSE),\"Help!\"))","v":""},null,{"$f":"IF(CC7=\"\",\"\",CA7+IF(CC7=\"XX\",VLOOKUP(\"WRONG\",Answers!AM:AN,2,FALSE),CC7)+CD7)","v":""},null,null,"","","","",""]
["[*]",{"$f":"Mainframe!B7","v":0},6,{"$f":"Mainframe!C7","v":0},{"$f":"IF(D8=0,\"\",IF(NOT(ISNA(VLOOKUP(D8,Answers!A:B,2,FALSE))),VLOOKUP(D8,Answers!A:B,2,FALSE),\"Help!\"))","v":""},null,{"$f":"IF(E8=\"\",\"\",IF(E8=\"XX\",VLOOKUP(\"WRONG\",Answers!A:B,2,FALSE),E8)+F8)","v":""},{"$f":"Mainframe!D7","v":0},{"$f":"IF(H8=0,\"\",IF(NOT(ISNA(VLOOKUP(H8,Answers!C:D,2,FALSE))),VLOOKUP(H8,Answers!C:D,2,FALSE),\"Help!\"))","v":""},null,{"$f":"IF(I8=\"\",\"\",G8+IF(I8=\"XX\",VLOOKUP(\"WRONG\",Answers!C:D,2,FALSE),I8)+J8)","v":""},{"$f":"Mainframe!E7","v":0},{"$f":"IF(L8=0,\"\",IF(NOT(ISNA(VLOOKUP(L8,Answers!E:F,2,FALSE))),VLOOKUP(L8,Answers!E:F,2,FALSE),\"Help!\"))","v":""},null,{"$f":"IF(M8=\"\",\"\",K8+IF(M8=\"XX\",VLOOKUP(\"WRONG\",Answers!E:F,2,FALSE),M8)+N8)","v":""},{"$f":"Mainframe!F7","v":0},{"$f":"IF(P8=0,\"\",IF(NOT(ISNA(VLOOKUP(P8,Answers!G:H,2,FALSE))),VLOOKUP(P8,Answers!G:H,2,FALSE),\"Help!\"))","v":""},null,{"$f":"IF(Q8=\"\",\"\",O8+IF(Q8=\"XX\",VLOOKUP(\"WRONG\",Answers!G:H,2,FALSE),Q8)+R8)","v":""},{"$f":"Mainframe!G7","v":0},{"$f":"IF(T8=0,\"\",IF(NOT(ISNA(VLOOKUP(T8,Answers!I:J,2,FALSE))),VLOOKUP(T8,Answers!I:J,2,FALSE),\"Help!\"))","v":""},null,{"$f":"IF(U8=\"\",\"\",S8+IF(U8=\"XX\",VLOOKUP(\"WRONG\",Answers!I:J,2,FALSE),U8)+V8)","v":""},{"$f":"Mainframe!H7","v":0},{"$f":"IF(X8=0,\"\",IF(NOT(ISNA(VLOOKUP(X8,Answers!K:L,2,FALSE))),VLOOKUP(X8,Answers!K:L,2,FALSE),\"Help!\"))","v":""},null,{"$f":"IF(Y8=\"\",\"\",W8+IF(Y8=\"XX\",VLOOKUP(\"WRONG\",Answers!K:L,2,FALSE),Y8)+Z8)","v":""},{"$f":"Mainframe!I7","v":0},{"$f":"IF(AB8=0,\"\",IF(NOT(ISNA(VLOOKUP(AB8,Answers!M:N,2,FALSE))),VLOOKUP(AB8,Answers!M:N,2,FALSE),\"Help!\"))","v":""},null,{"$f":"IF(AC8=\"\",\"\",AA8+IF(AC8=\"XX\",VLOOKUP(\"WRONG\",Answers!M:N,2,FALSE),AC8)+AD8)","v":""},{"$f":"Mainframe!J7","v":0},{"$f":"IF(AF8=0,\"\",IF(NOT(ISNA(VLOOKUP(AF8,Answers!O:P,2,FALSE))),VLOOKUP(AF8,Answers!O:P,2,FALSE),\"Help!\"))","v":""},null,{"$f":"IF(AG8=\"\",\"\",AE8+IF(AG8=\"XX\",VLOOKUP(\"WRONG\",Answers!O:P,2,FALSE),AG8)+AH8)","v":""},{"$f":"Mainframe!K7","v":0},{"$f":"IF(AJ8=0,\"\",IF(NOT(ISNA(VLOOKUP(AJ8,Answers!Q:R,2,FALSE))),VLOOKUP(AJ8,Answers!Q:R,2,FALSE),\"Help!\"))","v":""},null,{"$f":"IF(AK8=\"\",\"\",AI8+IF(AK8=\"XX\",VLOOKUP(\"WRONG\",Answers!Q:R,2,FALSE),AK8)+AL8)","v":""},{"$f":"Mainframe!L7","v":0},{"$f":"IF(AN8=0,\"\",IF(NOT(ISNA(VLOOKUP(AN8,Answers!S:T,2,FALSE))),VLOOKUP(AN8,Answers!S:T,2,FALSE),\"Help!\"))","v":""},null,{"$f":"IF(AO8=\"\",\"\",AM8+IF(AO8=\"XX\",VLOOKUP(\"WRONG\",Answers!S:T,2,FALSE),AO8)+AP8)","v":""},{"$f":"Mainframe!M7","v":0},{"$f":"IF(AR8=0,\"\",IF(NOT(ISNA(VLOOKUP(AR8,Answers!U:V,2,FALSE))),VLOOKUP(AR8,Answers!U:V,2,FALSE),\"Help!\"))","v":""},null,{"$f":"IF(AS8=\"\",\"\",AQ8+IF(AS8=\"XX\",VLOOKUP(\"WRONG\",Answers!U:V,2,FALSE),AS8)+AT8)","v":""},{"$f":"Mainframe!N7","v":0},{"$f":"IF(AV8=0,\"\",IF(NOT(ISNA(VLOOKUP(AV8,Answers!W:X,2,FALSE))),VLOOKUP(AV8,Answers!W:X,2,FALSE),\"Help!\"))","v":""},null,{"$f":"IF(AW8=\"\",\"\",AU8+IF(AW8=\"XX\",VLOOKUP(\"WRONG\",Answers!W:X,2,FALSE),AW8)+AX8)","v":""},{"$f":"Mainframe!O7","v":0},{"$f":"IF(AZ8=0,\"\",IF(NOT(ISNA(VLOOKUP(AZ8,Answers!Y:Z,2,FALSE))),VLOOKUP(AZ8,Answers!Y:Z,2,FALSE),\"Help!\"))","v":""},null,{"$f":"IF(BA8=\"\",\"\",AY8+IF(BA8=\"XX\",VLOOKUP(\"WRONG\",Answers!Y:Z,2,FALSE),BA8)+BB8)","v":""},{"$f":"Mainframe!P7","v":0},{"$f":"IF(BD8=0,\"\",IF(NOT(ISNA(VLOOKUP(BD8,Answers!AA:AB,2,FALSE))),VLOOKUP(BD8,Answers!AA:AB,2,FALSE),\"Help!\"))","v":""},null,{"$f":"IF(BE8=\"\",\"\",BC8+IF(BE8=\"XX\",VLOOKUP(\"WRONG\",Answers!AA:AB,2,FALSE),BE8)+BF8)","v":""},{"$f":"Mainframe!Q7","v":0},{"$f":"IF(BH8=0,\"\",IF(NOT(ISNA(VLOOKUP(BH8,Answers!AC:AD,2,FALSE))),VLOOKUP(BH8,Answers!AC:AD,2,FALSE),\"Help!\"))","v":""},null,{"$f":"IF(BI8=\"\",\"\",BG8+IF(BI8=\"XX\",VLOOKUP(\"WRONG\",Answers!AC:AD,2,FALSE),BI8)+BJ8)","v":""},{"$f":"Mainframe!R7","v":0},{"$f":"IF(BL8=0,\"\",IF(NOT(ISNA(VLOOKUP(BL8,Answers!AE:AF,2,FALSE))),VLOOKUP(BL8,Answers!AE:AF,2,FALSE),\"Help!\"))","v":""},null,{"$f":"IF(BM8=\"\",\"\",BK8+IF(BM8=\"XX\",VLOOKUP(\"WRONG\",Answers!AE:AF,2,FALSE),BM8)+BN8)","v":""},{"$f":"Mainframe!S7","v":0},{"$f":"IF(BP8=0,\"\",IF(NOT(ISNA(VLOOKUP(BP8,Answers!AG:AH,2,FALSE))),VLOOKUP(BP8,Answers!AG:AH,2,FALSE),\"Help!\"))","v":""},null,{"$f":"IF(BQ8=\"\",\"\",BO8+IF(BQ8=\"XX\",VLOOKUP(\"WRONG\",Answers!AG:AH,2,FALSE),BQ8)+BR8)","v":""},{"$f":"Mainframe!T7","v":0},{"$f":"IF(BT8=0,\"\",IF(NOT(ISNA(VLOOKUP(BT8,Answers!AI:AJ,2,FALSE))),VLOOKUP(BT8,Answers!AI:AJ,2,FALSE),\"Help!\"))","v":""},null,{"$f":"IF(BU8=\"\",\"\",BS8+IF(BU8=\"XX\",VLOOKUP(\"WRONG\",Answers!AI:AJ,2,FALSE),BU8)+BV8)","v":""},{"$f":"Mainframe!U7","v":0},{"$f":"IF(BX8=0,\"\",IF(NOT(ISNA(VLOOKUP(BX8,Answers!AK:AL,2,FALSE))),VLOOKUP(BX8,Answers!AK:AL,2,FALSE),\"Help!\"))","v":""},null,{"$f":"IF(BY8=\"\",\"\",BW8+IF(BY8=\"XX\",VLOOKUP(\"WRONG\",Answers!AK:AL,2,FALSE),BY8)+BZ8)","v":""},{"$f":"Mainframe!V7","v":0},{"$f":"IF(CB8=0,\"\",IF(NOT(ISNA(VLOOKUP(CB8,Answers!AM:AN,2,FALSE))),VLOOKUP(CB8,Answers!AM:AN,2,FALSE),\"Help!\"))","v":""},null,{"$f":"IF(CC8=\"\",\"\",CA8+IF(CC8=\"XX\",VLOOKUP(\"WRONG\",Answers!AM:AN,2,FALSE),CC8)+CD8)","v":""},null,null,"","","","",""]
["[*]",{"$f":"Mainframe!B8","v":0},7,{"$f":"Mainframe!C8","v":0},{"$f":"IF(D9=0,\"\",IF(NOT(ISNA(VLOOKUP(D9,Answers!A:B,2,FALSE))),VLOOKUP(D9,Answers!A:B,2,FALSE),\"Help!\"))","v":""},null,{"$f":"IF(E9=\"\",\"\",IF(E9=\"XX\",VLOOKUP(\"WRONG\",Answers!A:B,2,FALSE),E9)+F9)","v":""},{"$f":"Mainframe!D8","v":0},{"$f":"IF(H9=0,\"\",IF(NOT(ISNA(VLOOKUP(H9,Answers!C:D,2,FALSE))),VLOOKUP(H9,Answers!C:D,2,FALSE),\"Help!\"))","v":""},null,{"$f":"IF(I9=\"\",\"\",G9+IF(I9=\"XX\",VLOOKUP(\"WRONG\",Answers!C:D,2,FALSE),I9)+J9)","v":""},{"$f":"Mainframe!E8","v":0},{"$f":"IF(L9=0,\"\",IF(NOT(ISNA(VLOOKUP(L9,Answers!E:F,2,FALSE))),VLOOKUP(L9,Answers!E:F,2,FALSE),\"Help!\"))","v":""},null,{"$f":"IF(M9=\"\",\"\",K9+IF(M9=\"XX\",VLOOKUP(\"WRONG\",Answers!E:F,2,FALSE),M9)+N9)","v":""},{"$f":"Mainframe!F8","v":0},{"$f":"IF(P9=0,\"\",IF(NOT(ISNA(VLOOKUP(P9,Answers!G:H,2,FALSE))),VLOOKUP(P9,Answers!G:H,2,FALSE),\"Help!\"))","v":""},null,{"$f":"IF(Q9=\"\",\"\",O9+IF(Q9=\"XX\",VLOOKUP(\"WRONG\",Answers!G:H,2,FALSE),Q9)+R9)","v":""},{"$f":"Mainframe!G8","v":0},{"$f":"IF(T9=0,\"\",IF(NOT(ISNA(VLOOKUP(T9,Answers!I:J,2,FALSE))),VLOOKUP(T9,Answers!I:J,2,FALSE),\"Help!\"))","v":""},null,{"$f":"IF(U9=\"\",\"\",S9+IF(U9=\"XX\",VLOOKUP(\"WRONG\",Answers!I:J,2,FALSE),U9)+V9)","v":""},{"$f":"Mainframe!H8","v":0},{"$f":"IF(X9=0,\"\",IF(NOT(ISNA(VLOOKUP(X9,Answers!K:L,2,FALSE))),VLOOKUP(X9,Answers!K:L,2,FALSE),\"Help!\"))","v":""},null,{"$f":"IF(Y9=\"\",\"\",W9+IF(Y9=\"XX\",VLOOKUP(\"WRONG\",Answers!K:L,2,FALSE),Y9)+Z9)","v":""},{"$f":"Mainframe!I8","v":0},{"$f":"IF(AB9=0,\"\",IF(NOT(ISNA(VLOOKUP(AB9,Answers!M:N,2,FALSE))),VLOOKUP(AB9,Answers!M:N,2,FALSE),\"Help!\"))","v":""},null,{"$f":"IF(AC9=\"\",\"\",AA9+IF(AC9=\"XX\",VLOOKUP(\"WRONG\",Answers!M:N,2,FALSE),AC9)+AD9)","v":""},{"$f":"Mainframe!J8","v":0},{"$f":"IF(AF9=0,\"\",IF(NOT(ISNA(VLOOKUP(AF9,Answers!O:P,2,FALSE))),VLOOKUP(AF9,Answers!O:P,2,FALSE),\"Help!\"))","v":""},null,{"$f":"IF(AG9=\"\",\"\",AE9+IF(AG9=\"XX\",VLOOKUP(\"WRONG\",Answers!O:P,2,FALSE),AG9)+AH9)","v":""},{"$f":"Mainframe!K8","v":0},{"$f":"IF(AJ9=0,\"\",IF(NOT(ISNA(VLOOKUP(AJ9,Answers!Q:R,2,FALSE))),VLOOKUP(AJ9,Answers!Q:R,2,FALSE),\"Help!\"))","v":""},null,{"$f":"IF(AK9=\"\",\"\",AI9+IF(AK9=\"XX\",VLOOKUP(\"WRONG\",Answers!Q:R,2,FALSE),AK9)+AL9)","v":""},{"$f":"Mainframe!L8","v":0},{"$f":"IF(AN9=0,\"\",IF(NOT(ISNA(VLOOKUP(AN9,Answers!S:T,2,FALSE))),VLOOKUP(AN9,Answers!S:T,2,FALSE),\"Help!\"))","v":""},null,{"$f":"IF(AO9=\"\",\"\",AM9+IF(AO9=\"XX\",VLOOKUP(\"WRONG\",Answers!S:T,2,FALSE),AO9)+AP9)","v":""},{"$f":"Mainframe!M8","v":0},{"$f":"IF(AR9=0,\"\",IF(NOT(ISNA(VLOOKUP(AR9,Answers!U:V,2,FALSE))),VLOOKUP(AR9,Answers!U:V,2,FALSE),\"Help!\"))","v":""},null,{"$f":"IF(AS9=\"\",\"\",AQ9+IF(AS9=\"XX\",VLOOKUP(\"WRONG\",Answers!U:V,2,FALSE),AS9)+AT9)","v":""},{"$f":"Mainframe!N8","v":0},{"$f":"IF(AV9=0,\"\",IF(NOT(ISNA(VLOOKUP(AV9,Answers!W:X,2,FALSE))),VLOOKUP(AV9,Answers!W:X,2,FALSE),\"Help!\"))","v":""},null,{"$f":"IF(AW9=\"\",\"\",AU9+IF(AW9=\"XX\",VLOOKUP(\"WRONG\",Answers!W:X,2,FALSE),AW9)+AX9)","v":""},{"$f":"Mainframe!O8","v":0},{"$f":"IF(AZ9=0,\"\",IF(NOT(ISNA(VLOOKUP(AZ9,Answers!Y:Z,2,FALSE))),VLOOKUP(AZ9,Answers!Y:Z,2,FALSE),\"Help!\"))","v":""},null,{"$f":"IF(BA9=\"\",\"\",AY9+IF(BA9=\"XX\",VLOOKUP(\"WRONG\",Answers!Y:Z,2,FALSE),BA9)+BB9)","v":""},{"$f":"Mainframe!P8","v":0},{"$f":"IF(BD9=0,\"\",IF(NOT(ISNA(VLOOKUP(BD9,Answers!AA:AB,2,FALSE))),VLOOKUP(BD9,Answers!AA:AB,2,FALSE),\"Help!\"))","v":""},null,{"$f":"IF(BE9=\"\",\"\",BC9+IF(BE9=\"XX\",VLOOKUP(\"WRONG\",Answers!AA:AB,2,FALSE),BE9)+BF9)","v":""},{"$f":"Mainframe!Q8","v":0},{"$f":"IF(BH9=0,\"\",IF(NOT(ISNA(VLOOKUP(BH9,Answers!AC:AD,2,FALSE))),VLOOKUP(BH9,Answers!AC:AD,2,FALSE),\"Help!\"))","v":""},null,{"$f":"IF(BI9=\"\",\"\",BG9+IF(BI9=\"XX\",VLOOKUP(\"WRONG\",Answers!AC:AD,2,FALSE),BI9)+BJ9)","v":""},{"$f":"Mainframe!R8","v":0},{"$f":"IF(BL9=0,\"\",IF(NOT(ISNA(VLOOKUP(BL9,Answers!AE:AF,2,FALSE))),VLOOKUP(BL9,Answers!AE:AF,2,FALSE),\"Help!\"))","v":""},null,{"$f":"IF(BM9=\"\",\"\",BK9+IF(BM9=\"XX\",VLOOKUP(\"WRONG\",Answers!AE:AF,2,FALSE),BM9)+BN9)","v":""},{"$f":"Mainframe!S8","v":0},{"$f":"IF(BP9=0,\"\",IF(NOT(ISNA(VLOOKUP(BP9,Answers!AG:AH,2,FALSE))),VLOOKUP(BP9,Answers!AG:AH,2,FALSE),\"Help!\"))","v":""},null,{"$f":"IF(BQ9=\"\",\"\",BO9+IF(BQ9=\"XX\",VLOOKUP(\"WRONG\",Answers!AG:AH,2,FALSE),BQ9)+BR9)","v":""},{"$f":"Mainframe!T8","v":0},{"$f":"IF(BT9=0,\"\",IF(NOT(ISNA(VLOOKUP(BT9,Answers!AI:AJ,2,FALSE))),VLOOKUP(BT9,Answers!AI:AJ,2,FALSE),\"Help!\"))","v":""},null,{"$f":"IF(BU9=\"\",\"\",BS9+IF(BU9=\"XX\",VLOOKUP(\"WRONG\",Answers!AI:AJ,2,FALSE),BU9)+BV9)","v":""},{"$f":"Mainframe!U8","v":0},{"$f":"IF(BX9=0,\"\",IF(NOT(ISNA(VLOOKUP(BX9,Answers!AK:AL,2,FALSE))),VLOOKUP(BX9,Answers!AK:AL,2,FALSE),\"Help!\"))","v":""},null,{"$f":"IF(BY9=\"\",\"\",BW9+IF(BY9=\"XX\",VLOOKUP(\"WRONG\",Answers!AK:AL,2,FALSE),BY9)+BZ9)","v":""},{"$f":"Mainframe!V8","v":0},{"$f":"IF(CB9=0,\"\",IF(NOT(ISNA(VLOOKUP(CB9,Answers!AM:AN,2,FALSE))),VLOOKUP(CB9,Answers!AM:AN,2,FALSE),\"Help!\"))","v":""},null,{"$f":"IF(CC9=\"\",\"\",CA9+IF(CC9=\"XX\",VLOOKUP(\"WRONG\",Answers!AM:AN,2,FALSE),CC9)+CD9)","v":""},null,null,"","","","",""]
["[*]",{"$f":"Mainframe!B9","v":0},8,{"$f":"Mainframe!C9","v":0},{"$f":"IF(D10=0,\"\",IF(NOT(ISNA(VLOOKUP(D10,Answers!A:B,2,FALSE))),VLOOKUP(D10,Answers!A:B,2,FALSE),\"Help!\"))","v":""},null,{"$f":"IF(E10=\"\",\"\",IF(E10=\"XX\",VLOOKUP(\"WRONG\",Answers!A:B,2,FALSE),E10)+F10)","v":""},{"$f":"Mainframe!D9","v":0},{"$f":"IF(H10=0,\"\",IF(NOT(ISNA(VLOOKUP(H10,Answers!C:D,2,FALSE))),VLOOKUP(H10,Answers!C:D,2,FALSE),\"Help!\"))","v":""},null,{"$f":"IF(I10=\"\",\"\",G10+IF(I10=\"XX\",VLOOKUP(\"WRONG\",Answers!C:D,2,FALSE),I10)+J10)","v":""},{"$f":"Mainframe!E9","v":0},{"$f":"IF(L10=0,\"\",IF(NOT(ISNA(VLOOKUP(L10,Answers!E:F,2,FALSE))),VLOOKUP(L10,Answers!E:F,2,FALSE),\"Help!\"))","v":""},null,{"$f":"IF(M10=\"\",\"\",K10+IF(M10=\"XX\",VLOOKUP(\"WRONG\",Answers!E:F,2,FALSE),M10)+N10)","v":""},{"$f":"Mainframe!F9","v":0},{"$f":"IF(P10=0,\"\",IF(NOT(ISNA(VLOOKUP(P10,Answers!G:H,2,FALSE))),VLOOKUP(P10,Answers!G:H,2,FALSE),\"Help!\"))","v":""},null,{"$f":"IF(Q10=\"\",\"\",O10+IF(Q10=\"XX\",VLOOKUP(\"WRONG\",Answers!G:H,2,FALSE),Q10)+R10)","v":""},{"$f":"Mainframe!G9","v":0},{"$f":"IF(T10=0,\"\",IF(NOT(ISNA(VLOOKUP(T10,Answers!I:J,2,FALSE))),VLOOKUP(T10,Answers!I:J,2,FALSE),\"Help!\"))","v":""},null,{"$f":"IF(U10=\"\",\"\",S10+IF(U10=\"XX\",VLOOKUP(\"WRONG\",Answers!I:J,2,FALSE),U10)+V10)","v":""},{"$f":"Mainframe!H9","v":0},{"$f":"IF(X10=0,\"\",IF(NOT(ISNA(VLOOKUP(X10,Answers!K:L,2,FALSE))),VLOOKUP(X10,Answers!K:L,2,FALSE),\"Help!\"))","v":""},null,{"$f":"IF(Y10=\"\",\"\",W10+IF(Y10=\"XX\",VLOOKUP(\"WRONG\",Answers!K:L,2,FALSE),Y10)+Z10)","v":""},{"$f":"Mainframe!I9","v":0},{"$f":"IF(AB10=0,\"\",IF(NOT(ISNA(VLOOKUP(AB10,Answers!M:N,2,FALSE))),VLOOKUP(AB10,Answers!M:N,2,FALSE),\"Help!\"))","v":""},null,{"$f":"IF(AC10=\"\",\"\",AA10+IF(AC10=\"XX\",VLOOKUP(\"WRONG\",Answers!M:N,2,FALSE),AC10)+AD10)","v":""},{"$f":"Mainframe!J9","v":0},{"$f":"IF(AF10=0,\"\",IF(NOT(ISNA(VLOOKUP(AF10,Answers!O:P,2,FALSE))),VLOOKUP(AF10,Answers!O:P,2,FALSE),\"Help!\"))","v":""},null,{"$f":"IF(AG10=\"\",\"\",AE10+IF(AG10=\"XX\",VLOOKUP(\"WRONG\",Answers!O:P,2,FALSE),AG10)+AH10)","v":""},{"$f":"Mainframe!K9","v":0},{"$f":"IF(AJ10=0,\"\",IF(NOT(ISNA(VLOOKUP(AJ10,Answers!Q:R,2,FALSE))),VLOOKUP(AJ10,Answers!Q:R,2,FALSE),\"Help!\"))","v":""},null,{"$f":"IF(AK10=\"\",\"\",AI10+IF(AK10=\"XX\",VLOOKUP(\"WRONG\",Answers!Q:R,2,FALSE),AK10)+AL10)","v":""},{"$f":"Mainframe!L9","v":0},{"$f":"IF(AN10=0,\"\",IF(NOT(ISNA(VLOOKUP(AN10,Answers!S:T,2,FALSE))),VLOOKUP(AN10,Answers!S:T,2,FALSE),\"Help!\"))","v":""},null,{"$f":"IF(AO10=\"\",\"\",AM10+IF(AO10=\"XX\",VLOOKUP(\"WRONG\",Answers!S:T,2,FALSE),AO10)+AP10)","v":""},{"$f":"Mainframe!M9","v":0},{"$f":"IF(AR10=0,\"\",IF(NOT(ISNA(VLOOKUP(AR10,Answers!U:V,2,FALSE))),VLOOKUP(AR10,Answers!U:V,2,FALSE),\"Help!\"))","v":""},null,{"$f":"IF(AS10=\"\",\"\",AQ10+IF(AS10=\"XX\",VLOOKUP(\"WRONG\",Answers!U:V,2,FALSE),AS10)+AT10)","v":""},{"$f":"Mainframe!N9","v":0},{"$f":"IF(AV10=0,\"\",IF(NOT(ISNA(VLOOKUP(AV10,Answers!W:X,2,FALSE))),VLOOKUP(AV10,Answers!W:X,2,FALSE),\"Help!\"))","v":""},null,{"$f":"IF(AW10=\"\",\"\",AU10+IF(AW10=\"XX\",VLOOKUP(\"WRONG\",Answers!W:X,2,FALSE),AW10)+AX10)","v":""},{"$f":"Mainframe!O9","v":0},{"$f":"IF(AZ10=0,\"\",IF(NOT(ISNA(VLOOKUP(AZ10,Answers!Y:Z,2,FALSE))),VLOOKUP(AZ10,Answers!Y:Z,2,FALSE),\"Help!\"))","v":""},null,{"$f":"IF(BA10=\"\",\"\",AY10+IF(BA10=\"XX\",VLOOKUP(\"WRONG\",Answers!Y:Z,2,FALSE),BA10)+BB10)","v":""},{"$f":"Mainframe!P9","v":0},{"$f":"IF(BD10=0,\"\",IF(NOT(ISNA(VLOOKUP(BD10,Answers!AA:AB,2,FALSE))),VLOOKUP(BD10,Answers!AA:AB,2,FALSE),\"Help!\"))","v":""},null,{"$f":"IF(BE10=\"\",\"\",BC10+IF(BE10=\"XX\",VLOOKUP(\"WRONG\",Answers!AA:AB,2,FALSE),BE10)+BF10)","v":""},{"$f":"Mainframe!Q9","v":0},{"$f":"IF(BH10=0,\"\",IF(NOT(ISNA(VLOOKUP(BH10,Answers!AC:AD,2,FALSE))),VLOOKUP(BH10,Answers!AC:AD,2,FALSE),\"Help!\"))","v":""},null,{"$f":"IF(BI10=\"\",\"\",BG10+IF(BI10=\"XX\",VLOOKUP(\"WRONG\",Answers!AC:AD,2,FALSE),BI10)+BJ10)","v":""},{"$f":"Mainframe!R9","v":0},{"$f":"IF(BL10=0,\"\",IF(NOT(ISNA(VLOOKUP(BL10,Answers!AE:AF,2,FALSE))),VLOOKUP(BL10,Answers!AE:AF,2,FALSE),\"Help!\"))","v":""},null,{"$f":"IF(BM10=\"\",\"\",BK10+IF(BM10=\"XX\",VLOOKUP(\"WRONG\",Answers!AE:AF,2,FALSE),BM10)+BN10)","v":""},{"$f":"Mainframe!S9","v":0},{"$f":"IF(BP10=0,\"\",IF(NOT(ISNA(VLOOKUP(BP10,Answers!AG:AH,2,FALSE))),VLOOKUP(BP10,Answers!AG:AH,2,FALSE),\"Help!\"))","v":""},null,{"$f":"IF(BQ10=\"\",\"\",BO10+IF(BQ10=\"XX\",VLOOKUP(\"WRONG\",Answers!AG:AH,2,FALSE),BQ10)+BR10)","v":""},{"$f":"Mainframe!T9","v":0},{"$f":"IF(BT10=0,\"\",IF(NOT(ISNA(VLOOKUP(BT10,Answers!AI:AJ,2,FALSE))),VLOOKUP(BT10,Answers!AI:AJ,2,FALSE),\"Help!\"))","v":""},null,{"$f":"IF(BU10=\"\",\"\",BS10+IF(BU10=\"XX\",VLOOKUP(\"WRONG\",Answers!AI:AJ,2,FALSE),BU10)+BV10)","v":""},{"$f":"Mainframe!U9","v":0},{"$f":"IF(BX10=0,\"\",IF(NOT(ISNA(VLOOKUP(BX10,Answers!AK:AL,2,FALSE))),VLOOKUP(BX10,Answers!AK:AL,2,FALSE),\"Help!\"))","v":""},null,{"$f":"IF(BY10=\"\",\"\",BW10+IF(BY10=\"XX\",VLOOKUP(\"WRONG\",Answers!AK:AL,2,FALSE),BY10)+BZ10)","v":""},{"$f":"Mainframe!V9","v":0},{"$f":"IF(CB10=0,\"\",IF(NOT(ISNA(VLOOKUP(CB10,Answers!AM:AN,2,FALSE))),VLOOKUP(CB10,Answers!AM:AN,2,FALSE),\"Help!\"))","v":""},null,{"$f":"IF(CC10=\"\",\"\",CA10+IF(CC10=\"XX\",VLOOKUP(\"WRONG\",Answers!AM:AN,2,FALSE),CC10)+CD10)","v":""},null,null,"","","","",""]
["[*]",{"$f":"Mainframe!B10","v":0},9,{"$f":"Mainframe!C10","v":0},{"$f":"IF(D11=0,\"\",IF(NOT(ISNA(VLOOKUP(D11,Answers!A:B,2,FALSE))),VLOOKUP(D11,Answers!A:B,2,FALSE),\"Help!\"))","v":""},null,{"$f":"IF(E11=\"\",\"\",IF(E11=\"XX\",VLOOKUP(\"WRONG\",Answers!A:B,2,FALSE),E11)+F11)","v":""},{"$f":"Mainframe!D10","v":0},{"$f":"IF(H11=0,\"\",IF(NOT(ISNA(VLOOKUP(H11,Answers!C:D,2,FALSE))),VLOOKUP(H11,Answers!C:D,2,FALSE),\"Help!\"))","v":""},null,{"$f":"IF(I11=\"\",\"\",G11+IF(I11=\"XX\",VLOOKUP(\"WRONG\",Answers!C:D,2,FALSE),I11)+J11)","v":""},{"$f":"Mainframe!E10","v":0},{"$f":"IF(L11=0,\"\",IF(NOT(ISNA(VLOOKUP(L11,Answers!E:F,2,FALSE))),VLOOKUP(L11,Answers!E:F,2,FALSE),\"Help!\"))","v":""},null,{"$f":"IF(M11=\"\",\"\",K11+IF(M11=\"XX\",VLOOKUP(\"WRONG\",Answers!E:F,2,FALSE),M11)+N11)","v":""},{"$f":"Mainframe!F10","v":0},{"$f":"IF(P11=0,\"\",IF(NOT(ISNA(VLOOKUP(P11,Answers!G:H,2,FALSE))),VLOOKUP(P11,Answers!G:H,2,FALSE),\"Help!\"))","v":""},null,{"$f":"IF(Q11=\"\",\"\",O11+IF(Q11=\"XX\",VLOOKUP(\"WRONG\",Answers!G:H,2,FALSE),Q11)+R11)","v":""},{"$f":"Mainframe!G10","v":0},{"$f":"IF(T11=0,\"\",IF(NOT(ISNA(VLOOKUP(T11,Answers!I:J,2,FALSE))),VLOOKUP(T11,Answers!I:J,2,FALSE),\"Help!\"))","v":""},null,{"$f":"IF(U11=\"\",\"\",S11+IF(U11=\"XX\",VLOOKUP(\"WRONG\",Answers!I:J,2,FALSE),U11)+V11)","v":""},{"$f":"Mainframe!H10","v":0},{"$f":"IF(X11=0,\"\",IF(NOT(ISNA(VLOOKUP(X11,Answers!K:L,2,FALSE))),VLOOKUP(X11,Answers!K:L,2,FALSE),\"Help!\"))","v":""},null,{"$f":"IF(Y11=\"\",\"\",W11+IF(Y11=\"XX\",VLOOKUP(\"WRONG\",Answers!K:L,2,FALSE),Y11)+Z11)","v":""},{"$f":"Mainframe!I10","v":0},{"$f":"IF(AB11=0,\"\",IF(NOT(ISNA(VLOOKUP(AB11,Answers!M:N,2,FALSE))),VLOOKUP(AB11,Answers!M:N,2,FALSE),\"Help!\"))","v":""},null,{"$f":"IF(AC11=\"\",\"\",AA11+IF(AC11=\"XX\",VLOOKUP(\"WRONG\",Answers!M:N,2,FALSE),AC11)+AD11)","v":""},{"$f":"Mainframe!J10","v":0},{"$f":"IF(AF11=0,\"\",IF(NOT(ISNA(VLOOKUP(AF11,Answers!O:P,2,FALSE))),VLOOKUP(AF11,Answers!O:P,2,FALSE),\"Help!\"))","v":""},null,{"$f":"IF(AG11=\"\",\"\",AE11+IF(AG11=\"XX\",VLOOKUP(\"WRONG\",Answers!O:P,2,FALSE),AG11)+AH11)","v":""},{"$f":"Mainframe!K10","v":0},{"$f":"IF(AJ11=0,\"\",IF(NOT(ISNA(VLOOKUP(AJ11,Answers!Q:R,2,FALSE))),VLOOKUP(AJ11,Answers!Q:R,2,FALSE),\"Help!\"))","v":""},null,{"$f":"IF(AK11=\"\",\"\",AI11+IF(AK11=\"XX\",VLOOKUP(\"WRONG\",Answers!Q:R,2,FALSE),AK11)+AL11)","v":""},{"$f":"Mainframe!L10","v":0},{"$f":"IF(AN11=0,\"\",IF(NOT(ISNA(VLOOKUP(AN11,Answers!S:T,2,FALSE))),VLOOKUP(AN11,Answers!S:T,2,FALSE),\"Help!\"))","v":""},null,{"$f":"IF(AO11=\"\",\"\",AM11+IF(AO11=\"XX\",VLOOKUP(\"WRONG\",Answers!S:T,2,FALSE),AO11)+AP11)","v":""},{"$f":"Mainframe!M10","v":0},{"$f":"IF(AR11=0,\"\",IF(NOT(ISNA(VLOOKUP(AR11,Answers!U:V,2,FALSE))),VLOOKUP(AR11,Answers!U:V,2,FALSE),\"Help!\"))","v":""},null,{"$f":"IF(AS11=\"\",\"\",AQ11+IF(AS11=\"XX\",VLOOKUP(\"WRONG\",Answers!U:V,2,FALSE),AS11)+AT11)","v":""},{"$f":"Mainframe!N10","v":0},{"$f":"IF(AV11=0,\"\",IF(NOT(ISNA(VLOOKUP(AV11,Answers!W:X,2,FALSE))),VLOOKUP(AV11,Answers!W:X,2,FALSE),\"Help!\"))","v":""},null,{"$f":"IF(AW11=\"\",\"\",AU11+IF(AW11=\"XX\",VLOOKUP(\"WRONG\",Answers!W:X,2,FALSE),AW11)+AX11)","v":""},{"$f":"Mainframe!O10","v":0},{"$f":"IF(AZ11=0,\"\",IF(NOT(ISNA(VLOOKUP(AZ11,Answers!Y:Z,2,FALSE))),VLOOKUP(AZ11,Answers!Y:Z,2,FALSE),\"Help!\"))","v":""},null,{"$f":"IF(BA11=\"\",\"\",AY11+IF(BA11=\"XX\",VLOOKUP(\"WRONG\",Answers!Y:Z,2,FALSE),BA11)+BB11)","v":""},{"$f":"Mainframe!P10","v":0},{"$f":"IF(BD11=0,\"\",IF(NOT(ISNA(VLOOKUP(BD11,Answers!AA:AB,2,FALSE))),VLOOKUP(BD11,Answers!AA:AB,2,FALSE),\"Help!\"))","v":""},null,{"$f":"IF(BE11=\"\",\"\",BC11+IF(BE11=\"XX\",VLOOKUP(\"WRONG\",Answers!AA:AB,2,FALSE),BE11)+BF11)","v":""},{"$f":"Mainframe!Q10","v":0},{"$f":"IF(BH11=0,\"\",IF(NOT(ISNA(VLOOKUP(BH11,Answers!AC:AD,2,FALSE))),VLOOKUP(BH11,Answers!AC:AD,2,FALSE),\"Help!\"))","v":""},null,{"$f":"IF(BI11=\"\",\"\",BG11+IF(BI11=\"XX\",VLOOKUP(\"WRONG\",Answers!AC:AD,2,FALSE),BI11)+BJ11)","v":""},{"$f":"Mainframe!R10","v":0},{"$f":"IF(BL11=0,\"\",IF(NOT(ISNA(VLOOKUP(BL11,Answers!AE:AF,2,FALSE))),VLOOKUP(BL11,Answers!AE:AF,2,FALSE),\"Help!\"))","v":""},null,{"$f":"IF(BM11=\"\",\"\",BK11+IF(BM11=\"XX\",VLOOKUP(\"WRONG\",Answers!AE:AF,2,FALSE),BM11)+BN11)","v":""},{"$f":"Mainframe!S10","v":0},{"$f":"IF(BP11=0,\"\",IF(NOT(ISNA(VLOOKUP(BP11,Answers!AG:AH,2,FALSE))),VLOOKUP(BP11,Answers!AG:AH,2,FALSE),\"Help!\"))","v":""},null,{"$f":"IF(BQ11=\"\",\"\",BO11+IF(BQ11=\"XX\",VLOOKUP(\"WRONG\",Answers!AG:AH,2,FALSE),BQ11)+BR11)","v":""},{"$f":"Mainframe!T10","v":0},{"$f":"IF(BT11=0,\"\",IF(NOT(ISNA(VLOOKUP(BT11,Answers!AI:AJ,2,FALSE))),VLOOKUP(BT11,Answers!AI:AJ,2,FALSE),\"Help!\"))","v":""},null,{"$f":"IF(BU11=\"\",\"\",BS11+IF(BU11=\"XX\",VLOOKUP(\"WRONG\",Answers!AI:AJ,2,FALSE),BU11)+BV11)","v":""},{"$f":"Mainframe!U10","v":0},{"$f":"IF(BX11=0,\"\",IF(NOT(ISNA(VLOOKUP(BX11,Answers!AK:AL,2,FALSE))),VLOOKUP(BX11,Answers!AK:AL,2,FALSE),\"Help!\"))","v":""},null,{"$f":"IF(BY11=\"\",\"\",BW11+IF(BY11=\"XX\",VLOOKUP(\"WRONG\",Answers!AK:AL,2,FALSE),BY11)+BZ11)","v":""},{"$f":"Mainframe!V10","v":0},{"$f":"IF(CB11=0,\"\",IF(NOT(ISNA(VLOOKUP(CB11,Answers!AM:AN,2,FALSE))),VLOOKUP(CB11,Answers!AM:AN,2,FALSE),\"Help!\"))","v":""},null,{"$f":"IF(CC11=\"\",\"\",CA11+IF(CC11=\"XX\",VLOOKUP(\"WRONG\",Answers!AM:AN,2,FALSE),CC11)+CD11)","v":""},null,null,"","","","",""]
["[*]",{"$f":"Mainframe!B11","v":0},10,{"$f":"Mainframe!C11","v":0},{"$f":"IF(D12=0,\"\",IF(NOT(ISNA(VLOOKUP(D12,Answers!A:B,2,FALSE))),VLOOKUP(D12,Answers!A:B,2,FALSE),\"Help!\"))","v":""},null,{"$f":"IF(E12=\"\",\"\",IF(E12=\"XX\",VLOOKUP(\"WRONG\",Answers!A:B,2,FALSE),E12)+F12)","v":""},{"$f":"Mainframe!D11","v":0},{"$f":"IF(H12=0,\"\",IF(NOT(ISNA(VLOOKUP(H12,Answers!C:D,2,FALSE))),VLOOKUP(H12,Answers!C:D,2,FALSE),\"Help!\"))","v":""},null,{"$f":"IF(I12=\"\",\"\",G12+IF(I12=\"XX\",VLOOKUP(\"WRONG\",Answers!C:D,2,FALSE),I12)+J12)","v":""},{"$f":"Mainframe!E11","v":0},{"$f":"IF(L12=0,\"\",IF(NOT(ISNA(VLOOKUP(L12,Answers!E:F,2,FALSE))),VLOOKUP(L12,Answers!E:F,2,FALSE),\"Help!\"))","v":""},null,{"$f":"IF(M12=\"\",\"\",K12+IF(M12=\"XX\",VLOOKUP(\"WRONG\",Answers!E:F,2,FALSE),M12)+N12)","v":""},{"$f":"Mainframe!F11","v":0},{"$f":"IF(P12=0,\"\",IF(NOT(ISNA(VLOOKUP(P12,Answers!G:H,2,FALSE))),VLOOKUP(P12,Answers!G:H,2,FALSE),\"Help!\"))","v":""},null,{"$f":"IF(Q12=\"\",\"\",O12+IF(Q12=\"XX\",VLOOKUP(\"WRONG\",Answers!G:H,2,FALSE),Q12)+R12)","v":""},{"$f":"Mainframe!G11","v":0},{"$f":"IF(T12=0,\"\",IF(NOT(ISNA(VLOOKUP(T12,Answers!I:J,2,FALSE))),VLOOKUP(T12,Answers!I:J,2,FALSE),\"Help!\"))","v":""},null,{"$f":"IF(U12=\"\",\"\",S12+IF(U12=\"XX\",VLOOKUP(\"WRONG\",Answers!I:J,2,FALSE),U12)+V12)","v":""},{"$f":"Mainframe!H11","v":0},{"$f":"IF(X12=0,\"\",IF(NOT(ISNA(VLOOKUP(X12,Answers!K:L,2,FALSE))),VLOOKUP(X12,Answers!K:L,2,FALSE),\"Help!\"))","v":""},null,{"$f":"IF(Y12=\"\",\"\",W12+IF(Y12=\"XX\",VLOOKUP(\"WRONG\",Answers!K:L,2,FALSE),Y12)+Z12)","v":""},{"$f":"Mainframe!I11","v":0},{"$f":"IF(AB12=0,\"\",IF(NOT(ISNA(VLOOKUP(AB12,Answers!M:N,2,FALSE))),VLOOKUP(AB12,Answers!M:N,2,FALSE),\"Help!\"))","v":""},null,{"$f":"IF(AC12=\"\",\"\",AA12+IF(AC12=\"XX\",VLOOKUP(\"WRONG\",Answers!M:N,2,FALSE),AC12)+AD12)","v":""},{"$f":"Mainframe!J11","v":0},{"$f":"IF(AF12=0,\"\",IF(NOT(ISNA(VLOOKUP(AF12,Answers!O:P,2,FALSE))),VLOOKUP(AF12,Answers!O:P,2,FALSE),\"Help!\"))","v":""},null,{"$f":"IF(AG12=\"\",\"\",AE12+IF(AG12=\"XX\",VLOOKUP(\"WRONG\",Answers!O:P,2,FALSE),AG12)+AH12)","v":""},{"$f":"Mainframe!K11","v":0},{"$f":"IF(AJ12=0,\"\",IF(NOT(ISNA(VLOOKUP(AJ12,Answers!Q:R,2,FALSE))),VLOOKUP(AJ12,Answers!Q:R,2,FALSE),\"Help!\"))","v":""},null,{"$f":"IF(AK12=\"\",\"\",AI12+IF(AK12=\"XX\",VLOOKUP(\"WRONG\",Answers!Q:R,2,FALSE),AK12)+AL12)","v":""},{"$f":"Mainframe!L11","v":0},{"$f":"IF(AN12=0,\"\",IF(NOT(ISNA(VLOOKUP(AN12,Answers!S:T,2,FALSE))),VLOOKUP(AN12,Answers!S:T,2,FALSE),\"Help!\"))","v":""},null,{"$f":"IF(AO12=\"\",\"\",AM12+IF(AO12=\"XX\",VLOOKUP(\"WRONG\",Answers!S:T,2,FALSE),AO12)+AP12)","v":""},{"$f":"Mainframe!M11","v":0},{"$f":"IF(AR12=0,\"\",IF(NOT(ISNA(VLOOKUP(AR12,Answers!U:V,2,FALSE))),VLOOKUP(AR12,Answers!U:V,2,FALSE),\"Help!\"))","v":""},null,{"$f":"IF(AS12=\"\",\"\",AQ12+IF(AS12=\"XX\",VLOOKUP(\"WRONG\",Answers!U:V,2,FALSE),AS12)+AT12)","v":""},{"$f":"Mainframe!N11","v":0},{"$f":"IF(AV12=0,\"\",IF(NOT(ISNA(VLOOKUP(AV12,Answers!W:X,2,FALSE))),VLOOKUP(AV12,Answers!W:X,2,FALSE),\"Help!\"))","v":""},null,{"$f":"IF(AW12=\"\",\"\",AU12+IF(AW12=\"XX\",VLOOKUP(\"WRONG\",Answers!W:X,2,FALSE),AW12)+AX12)","v":""},{"$f":"Mainframe!O11","v":0},{"$f":"IF(AZ12=0,\"\",IF(NOT(ISNA(VLOOKUP(AZ12,Answers!Y:Z,2,FALSE))),VLOOKUP(AZ12,Answers!Y:Z,2,FALSE),\"Help!\"))","v":""},null,{"$f":"IF(BA12=\"\",\"\",AY12+IF(BA12=\"XX\",VLOOKUP(\"WRONG\",Answers!Y:Z,2,FALSE),BA12)+BB12)","v":""},{"$f":"Mainframe!P11","v":0},{"$f":"IF(BD12=0,\"\",IF(NOT(ISNA(VLOOKUP(BD12,Answers!AA:AB,2,FALSE))),VLOOKUP(BD12,Answers!AA:AB,2,FALSE),\"Help!\"))","v":""},null,{"$f":"IF(BE12=\"\",\"\",BC12+IF(BE12=\"XX\",VLOOKUP(\"WRONG\",Answers!AA:AB,2,FALSE),BE12)+BF12)","v":""},{"$f":"Mainframe!Q11","v":0},{"$f":"IF(BH12=0,\"\",IF(NOT(ISNA(VLOOKUP(BH12,Answers!AC:AD,2,FALSE))),VLOOKUP(BH12,Answers!AC:AD,2,FALSE),\"Help!\"))","v":""},null,{"$f":"IF(BI12=\"\",\"\",BG12+IF(BI12=\"XX\",VLOOKUP(\"WRONG\",Answers!AC:AD,2,FALSE),BI12)+BJ12)","v":""},{"$f":"Mainframe!R11","v":0},{"$f":"IF(BL12=0,\"\",IF(NOT(ISNA(VLOOKUP(BL12,Answers!AE:AF,2,FALSE))),VLOOKUP(BL12,Answers!AE:AF,2,FALSE),\"Help!\"))","v":""},null,{"$f":"IF(BM12=\"\",\"\",BK12+IF(BM12=\"XX\",VLOOKUP(\"WRONG\",Answers!AE:AF,2,FALSE),BM12)+BN12)","v":""},{"$f":"Mainframe!S11","v":0},{"$f":"IF(BP12=0,\"\",IF(NOT(ISNA(VLOOKUP(BP12,Answers!AG:AH,2,FALSE))),VLOOKUP(BP12,Answers!AG:AH,2,FALSE),\"Help!\"))","v":""},null,{"$f":"IF(BQ12=\"\",\"\",BO12+IF(BQ12=\"XX\",VLOOKUP(\"WRONG\",Answers!AG:AH,2,FALSE),BQ12)+BR12)","v":""},{"$f":"Mainframe!T11","v":0},{"$f":"IF(BT12=0,\"\",IF(NOT(ISNA(VLOOKUP(BT12,Answers!AI:AJ,2,FALSE))),VLOOKUP(BT12,Answers!AI:AJ,2,FALSE),\"Help!\"))","v":""},null,{"$f":"IF(BU12=\"\",\"\",BS12+IF(BU12=\"XX\",VLOOKUP(\"WRONG\",Answers!AI:AJ,2,FALSE),BU12)+BV12)","v":""},{"$f":"Mainframe!U11","v":0},{"$f":"IF(BX12=0,\"\",IF(NOT(ISNA(VLOOKUP(BX12,Answers!AK:AL,2,FALSE))),VLOOKUP(BX12,Answers!AK:AL,2,FALSE),\"Help!\"))","v":""},null,{"$f":"IF(BY12=\"\",\"\",BW12+IF(BY12=\"XX\",VLOOKUP(\"WRONG\",Answers!AK:AL,2,FALSE),BY12)+BZ12)","v":""},{"$f":"Mainframe!V11","v":0},{"$f":"IF(CB12=0,\"\",IF(NOT(ISNA(VLOOKUP(CB12,Answers!AM:AN,2,FALSE))),VLOOKUP(CB12,Answers!AM:AN,2,FALSE),\"Help!\"))","v":""},null,{"$f":"IF(CC12=\"\",\"\",CA12+IF(CC12=\"XX\",VLOOKUP(\"WRONG\",Answers!AM:AN,2,FALSE),CC12)+CD12)","v":""},null,null,"","","","",""]
["[*]",{"$f":"Mainframe!B12","v":0},11,{"$f":"Mainframe!C12","v":0},{"$f":"IF(D13=0,\"\",IF(NOT(ISNA(VLOOKUP(D13,Answers!A:B,2,FALSE))),VLOOKUP(D13,Answers!A:B,2,FALSE),\"Help!\"))","v":""},null,{"$f":"IF(E13=\"\",\"\",IF(E13=\"XX\",VLOOKUP(\"WRONG\",Answers!A:B,2,FALSE),E13)+F13)","v":""},{"$f":"Mainframe!D12","v":0},{"$f":"IF(H13=0,\"\",IF(NOT(ISNA(VLOOKUP(H13,Answers!C:D,2,FALSE))),VLOOKUP(H13,Answers!C:D,2,FALSE),\"Help!\"))","v":""},null,{"$f":"IF(I13=\"\",\"\",G13+IF(I13=\"XX\",VLOOKUP(\"WRONG\",Answers!C:D,2,FALSE),I13)+J13)","v":""},{"$f":"Mainframe!E12","v":0},{"$f":"IF(L13=0,\"\",IF(NOT(ISNA(VLOOKUP(L13,Answers!E:F,2,FALSE))),VLOOKUP(L13,Answers!E:F,2,FALSE),\"Help!\"))","v":""},null,{"$f":"IF(M13=\"\",\"\",K13+IF(M13=\"XX\",VLOOKUP(\"WRONG\",Answers!E:F,2,FALSE),M13)+N13)","v":""},{"$f":"Mainframe!F12","v":0},{"$f":"IF(P13=0,\"\",IF(NOT(ISNA(VLOOKUP(P13,Answers!G:H,2,FALSE))),VLOOKUP(P13,Answers!G:H,2,FALSE),\"Help!\"))","v":""},null,{"$f":"IF(Q13=\"\",\"\",O13+IF(Q13=\"XX\",VLOOKUP(\"WRONG\",Answers!G:H,2,FALSE),Q13)+R13)","v":""},{"$f":"Mainframe!G12","v":0},{"$f":"IF(T13=0,\"\",IF(NOT(ISNA(VLOOKUP(T13,Answers!I:J,2,FALSE))),VLOOKUP(T13,Answers!I:J,2,FALSE),\"Help!\"))","v":""},null,{"$f":"IF(U13=\"\",\"\",S13+IF(U13=\"XX\",VLOOKUP(\"WRONG\",Answers!I:J,2,FALSE),U13)+V13)","v":""},{"$f":"Mainframe!H12","v":0},{"$f":"IF(X13=0,\"\",IF(NOT(ISNA(VLOOKUP(X13,Answers!K:L,2,FALSE))),VLOOKUP(X13,Answers!K:L,2,FALSE),\"Help!\"))","v":""},null,{"$f":"IF(Y13=\"\",\"\",W13+IF(Y13=\"XX\",VLOOKUP(\"WRONG\",Answers!K:L,2,FALSE),Y13)+Z13)","v":""},{"$f":"Mainframe!I12","v":0},{"$f":"IF(AB13=0,\"\",IF(NOT(ISNA(VLOOKUP(AB13,Answers!M:N,2,FALSE))),VLOOKUP(AB13,Answers!M:N,2,FALSE),\"Help!\"))","v":""},null,{"$f":"IF(AC13=\"\",\"\",AA13+IF(AC13=\"XX\",VLOOKUP(\"WRONG\",Answers!M:N,2,FALSE),AC13)+AD13)","v":""},{"$f":"Mainframe!J12","v":0},{"$f":"IF(AF13=0,\"\",IF(NOT(ISNA(VLOOKUP(AF13,Answers!O:P,2,FALSE))),VLOOKUP(AF13,Answers!O:P,2,FALSE),\"Help!\"))","v":""},null,{"$f":"IF(AG13=\"\",\"\",AE13+IF(AG13=\"XX\",VLOOKUP(\"WRONG\",Answers!O:P,2,FALSE),AG13)+AH13)","v":""},{"$f":"Mainframe!K12","v":0},{"$f":"IF(AJ13=0,\"\",IF(NOT(ISNA(VLOOKUP(AJ13,Answers!Q:R,2,FALSE))),VLOOKUP(AJ13,Answers!Q:R,2,FALSE),\"Help!\"))","v":""},null,{"$f":"IF(AK13=\"\",\"\",AI13+IF(AK13=\"XX\",VLOOKUP(\"WRONG\",Answers!Q:R,2,FALSE),AK13)+AL13)","v":""},{"$f":"Mainframe!L12","v":0},{"$f":"IF(AN13=0,\"\",IF(NOT(ISNA(VLOOKUP(AN13,Answers!S:T,2,FALSE))),VLOOKUP(AN13,Answers!S:T,2,FALSE),\"Help!\"))","v":""},null,{"$f":"IF(AO13=\"\",\"\",AM13+IF(AO13=\"XX\",VLOOKUP(\"WRONG\",Answers!S:T,2,FALSE),AO13)+AP13)","v":""},{"$f":"Mainframe!M12","v":0},{"$f":"IF(AR13=0,\"\",IF(NOT(ISNA(VLOOKUP(AR13,Answers!U:V,2,FALSE))),VLOOKUP(AR13,Answers!U:V,2,FALSE),\"Help!\"))","v":""},null,{"$f":"IF(AS13=\"\",\"\",AQ13+IF(AS13=\"XX\",VLOOKUP(\"WRONG\",Answers!U:V,2,FALSE),AS13)+AT13)","v":""},{"$f":"Mainframe!N12","v":0},{"$f":"IF(AV13=0,\"\",IF(NOT(ISNA(VLOOKUP(AV13,Answers!W:X,2,FALSE))),VLOOKUP(AV13,Answers!W:X,2,FALSE),\"Help!\"))","v":""},null,{"$f":"IF(AW13=\"\",\"\",AU13+IF(AW13=\"XX\",VLOOKUP(\"WRONG\",Answers!W:X,2,FALSE),AW13)+AX13)","v":""},{"$f":"Mainframe!O12","v":0},{"$f":"IF(AZ13=0,\"\",IF(NOT(ISNA(VLOOKUP(AZ13,Answers!Y:Z,2,FALSE))),VLOOKUP(AZ13,Answers!Y:Z,2,FALSE),\"Help!\"))","v":""},null,{"$f":"IF(BA13=\"\",\"\",AY13+IF(BA13=\"XX\",VLOOKUP(\"WRONG\",Answers!Y:Z,2,FALSE),BA13)+BB13)","v":""},{"$f":"Mainframe!P12","v":0},{"$f":"IF(BD13=0,\"\",IF(NOT(ISNA(VLOOKUP(BD13,Answers!AA:AB,2,FALSE))),VLOOKUP(BD13,Answers!AA:AB,2,FALSE),\"Help!\"))","v":""},null,{"$f":"IF(BE13=\"\",\"\",BC13+IF(BE13=\"XX\",VLOOKUP(\"WRONG\",Answers!AA:AB,2,FALSE),BE13)+BF13)","v":""},{"$f":"Mainframe!Q12","v":0},{"$f":"IF(BH13=0,\"\",IF(NOT(ISNA(VLOOKUP(BH13,Answers!AC:AD,2,FALSE))),VLOOKUP(BH13,Answers!AC:AD,2,FALSE),\"Help!\"))","v":""},null,{"$f":"IF(BI13=\"\",\"\",BG13+IF(BI13=\"XX\",VLOOKUP(\"WRONG\",Answers!AC:AD,2,FALSE),BI13)+BJ13)","v":""},{"$f":"Mainframe!R12","v":0},{"$f":"IF(BL13=0,\"\",IF(NOT(ISNA(VLOOKUP(BL13,Answers!AE:AF,2,FALSE))),VLOOKUP(BL13,Answers!AE:AF,2,FALSE),\"Help!\"))","v":""},null,{"$f":"IF(BM13=\"\",\"\",BK13+IF(BM13=\"XX\",VLOOKUP(\"WRONG\",Answers!AE:AF,2,FALSE),BM13)+BN13)","v":""},{"$f":"Mainframe!S12","v":0},{"$f":"IF(BP13=0,\"\",IF(NOT(ISNA(VLOOKUP(BP13,Answers!AG:AH,2,FALSE))),VLOOKUP(BP13,Answers!AG:AH,2,FALSE),\"Help!\"))","v":""},null,{"$f":"IF(BQ13=\"\",\"\",BO13+IF(BQ13=\"XX\",VLOOKUP(\"WRONG\",Answers!AG:AH,2,FALSE),BQ13)+BR13)","v":""},{"$f":"Mainframe!T12","v":0},{"$f":"IF(BT13=0,\"\",IF(NOT(ISNA(VLOOKUP(BT13,Answers!AI:AJ,2,FALSE))),VLOOKUP(BT13,Answers!AI:AJ,2,FALSE),\"Help!\"))","v":""},null,{"$f":"IF(BU13=\"\",\"\",BS13+IF(BU13=\"XX\",VLOOKUP(\"WRONG\",Answers!AI:AJ,2,FALSE),BU13)+BV13)","v":""},{"$f":"Mainframe!U12","v":0},{"$f":"IF(BX13=0,\"\",IF(NOT(ISNA(VLOOKUP(BX13,Answers!AK:AL,2,FALSE))),VLOOKUP(BX13,Answers!AK:AL,2,FALSE),\"Help!\"))","v":""},null,{"$f":"IF(BY13=\"\",\"\",BW13+IF(BY13=\"XX\",VLOOKUP(\"WRONG\",Answers!AK:AL,2,FALSE),BY13)+BZ13)","v":""},{"$f":"Mainframe!V12","v":0},{"$f":"IF(CB13=0,\"\",IF(NOT(ISNA(VLOOKUP(CB13,Answers!AM:AN,2,FALSE))),VLOOKUP(CB13,Answers!AM:AN,2,FALSE),\"Help!\"))","v":""},null,{"$f":"IF(CC13=\"\",\"\",CA13+IF(CC13=\"XX\",VLOOKUP(\"WRONG\",Answers!AM:AN,2,FALSE),CC13)+CD13)","v":""},null,null,"","","","",""]
["[*]",{"$f":"Mainframe!B13","v":0},12,{"$f":"Mainframe!C13","v":0},{"$f":"IF(D14=0,\"\",IF(NOT(ISNA(VLOOKUP(D14,Answers!A:B,2,FALSE))),VLOOKUP(D14,Answers!A:B,2,FALSE),\"Help!\"))","v":""},null,{"$f":"IF(E14=\"\",\"\",IF(E14=\"XX\",VLOOKUP(\"WRONG\",Answers!A:B,2,FALSE),E14)+F14)","v":""},{"$f":"Mainframe!D13","v":0},{"$f":"IF(H14=0,\"\",IF(NOT(ISNA(VLOOKUP(H14,Answers!C:D,2,FALSE))),VLOOKUP(H14,Answers!C:D,2,FALSE),\"Help!\"))","v":""},null,{"$f":"IF(I14=\"\",\"\",G14+IF(I14=\"XX\",VLOOKUP(\"WRONG\",Answers!C:D,2,FALSE),I14)+J14)","v":""},{"$f":"Mainframe!E13","v":0},{"$f":"IF(L14=0,\"\",IF(NOT(ISNA(VLOOKUP(L14,Answers!E:F,2,FALSE))),VLOOKUP(L14,Answers!E:F,2,FALSE),\"Help!\"))","v":""},null,{"$f":"IF(M14=\"\",\"\",K14+IF(M14=\"XX\",VLOOKUP(\"WRONG\",Answers!E:F,2,FALSE),M14)+N14)","v":""},{"$f":"Mainframe!F13","v":0},{"$f":"IF(P14=0,\"\",IF(NOT(ISNA(VLOOKUP(P14,Answers!G:H,2,FALSE))),VLOOKUP(P14,Answers!G:H,2,FALSE),\"Help!\"))","v":""},null,{"$f":"IF(Q14=\"\",\"\",O14+IF(Q14=\"XX\",VLOOKUP(\"WRONG\",Answers!G:H,2,FALSE),Q14)+R14)","v":""},{"$f":"Mainframe!G13","v":0},{"$f":"IF(T14=0,\"\",IF(NOT(ISNA(VLOOKUP(T14,Answers!I:J,2,FALSE))),VLOOKUP(T14,Answers!I:J,2,FALSE),\"Help!\"))","v":""},null,{"$f":"IF(U14=\"\",\"\",S14+IF(U14=\"XX\",VLOOKUP(\"WRONG\",Answers!I:J,2,FALSE),U14)+V14)","v":""},{"$f":"Mainframe!H13","v":0},{"$f":"IF(X14=0,\"\",IF(NOT(ISNA(VLOOKUP(X14,Answers!K:L,2,FALSE))),VLOOKUP(X14,Answers!K:L,2,FALSE),\"Help!\"))","v":""},null,{"$f":"IF(Y14=\"\",\"\",W14+IF(Y14=\"XX\",VLOOKUP(\"WRONG\",Answers!K:L,2,FALSE),Y14)+Z14)","v":""},{"$f":"Mainframe!I13","v":0},{"$f":"IF(AB14=0,\"\",IF(NOT(ISNA(VLOOKUP(AB14,Answers!M:N,2,FALSE))),VLOOKUP(AB14,Answers!M:N,2,FALSE),\"Help!\"))","v":""},null,{"$f":"IF(AC14=\"\",\"\",AA14+IF(AC14=\"XX\",VLOOKUP(\"WRONG\",Answers!M:N,2,FALSE),AC14)+AD14)","v":""},{"$f":"Mainframe!J13","v":0},{"$f":"IF(AF14=0,\"\",IF(NOT(ISNA(VLOOKUP(AF14,Answers!O:P,2,FALSE))),VLOOKUP(AF14,Answers!O:P,2,FALSE),\"Help!\"))","v":""},null,{"$f":"IF(AG14=\"\",\"\",AE14+IF(AG14=\"XX\",VLOOKUP(\"WRONG\",Answers!O:P,2,FALSE),AG14)+AH14)","v":""},{"$f":"Mainframe!K13","v":0},{"$f":"IF(AJ14=0,\"\",IF(NOT(ISNA(VLOOKUP(AJ14,Answers!Q:R,2,FALSE))),VLOOKUP(AJ14,Answers!Q:R,2,FALSE),\"Help!\"))","v":""},null,{"$f":"IF(AK14=\"\",\"\",AI14+IF(AK14=\"XX\",VLOOKUP(\"WRONG\",Answers!Q:R,2,FALSE),AK14)+AL14)","v":""},{"$f":"Mainframe!L13","v":0},{"$f":"IF(AN14=0,\"\",IF(NOT(ISNA(VLOOKUP(AN14,Answers!S:T,2,FALSE))),VLOOKUP(AN14,Answers!S:T,2,FALSE),\"Help!\"))","v":""},null,{"$f":"IF(AO14=\"\",\"\",AM14+IF(AO14=\"XX\",VLOOKUP(\"WRONG\",Answers!S:T,2,FALSE),AO14)+AP14)","v":""},{"$f":"Mainframe!M13","v":0},{"$f":"IF(AR14=0,\"\",IF(NOT(ISNA(VLOOKUP(AR14,Answers!U:V,2,FALSE))),VLOOKUP(AR14,Answers!U:V,2,FALSE),\"Help!\"))","v":""},null,{"$f":"IF(AS14=\"\",\"\",AQ14+IF(AS14=\"XX\",VLOOKUP(\"WRONG\",Answers!U:V,2,FALSE),AS14)+AT14)","v":""},{"$f":"Mainframe!N13","v":0},{"$f":"IF(AV14=0,\"\",IF(NOT(ISNA(VLOOKUP(AV14,Answers!W:X,2,FALSE))),VLOOKUP(AV14,Answers!W:X,2,FALSE),\"Help!\"))","v":""},null,{"$f":"IF(AW14=\"\",\"\",AU14+IF(AW14=\"XX\",VLOOKUP(\"WRONG\",Answers!W:X,2,FALSE),AW14)+AX14)","v":""},{"$f":"Mainframe!O13","v":0},{"$f":"IF(AZ14=0,\"\",IF(NOT(ISNA(VLOOKUP(AZ14,Answers!Y:Z,2,FALSE))),VLOOKUP(AZ14,Answers!Y:Z,2,FALSE),\"Help!\"))","v":""},null,{"$f":"IF(BA14=\"\",\"\",AY14+IF(BA14=\"XX\",VLOOKUP(\"WRONG\",Answers!Y:Z,2,FALSE),BA14)+BB14)","v":""},{"$f":"Mainframe!P13","v":0},{"$f":"IF(BD14=0,\"\",IF(NOT(ISNA(VLOOKUP(BD14,Answers!AA:AB,2,FALSE))),VLOOKUP(BD14,Answers!AA:AB,2,FALSE),\"Help!\"))","v":""},null,{"$f":"IF(BE14=\"\",\"\",BC14+IF(BE14=\"XX\",VLOOKUP(\"WRONG\",Answers!AA:AB,2,FALSE),BE14)+BF14)","v":""},{"$f":"Mainframe!Q13","v":0},{"$f":"IF(BH14=0,\"\",IF(NOT(ISNA(VLOOKUP(BH14,Answers!AC:AD,2,FALSE))),VLOOKUP(BH14,Answers!AC:AD,2,FALSE),\"Help!\"))","v":""},null,{"$f":"IF(BI14=\"\",\"\",BG14+IF(BI14=\"XX\",VLOOKUP(\"WRONG\",Answers!AC:AD,2,FALSE),BI14)+BJ14)","v":""},{"$f":"Mainframe!R13","v":0},{"$f":"IF(BL14=0,\"\",IF(NOT(ISNA(VLOOKUP(BL14,Answers!AE:AF,2,FALSE))),VLOOKUP(BL14,Answers!AE:AF,2,FALSE),\"Help!\"))","v":""},null,{"$f":"IF(BM14=\"\",\"\",BK14+IF(BM14=\"XX\",VLOOKUP(\"WRONG\",Answers!AE:AF,2,FALSE),BM14)+BN14)","v":""},{"$f":"Mainframe!S13","v":0},{"$f":"IF(BP14=0,\"\",IF(NOT(ISNA(VLOOKUP(BP14,Answers!AG:AH,2,FALSE))),VLOOKUP(BP14,Answers!AG:AH,2,FALSE),\"Help!\"))","v":""},null,{"$f":"IF(BQ14=\"\",\"\",BO14+IF(BQ14=\"XX\",VLOOKUP(\"WRONG\",Answers!AG:AH,2,FALSE),BQ14)+BR14)","v":""},{"$f":"Mainframe!T13","v":0},{"$f":"IF(BT14=0,\"\",IF(NOT(ISNA(VLOOKUP(BT14,Answers!AI:AJ,2,FALSE))),VLOOKUP(BT14,Answers!AI:AJ,2,FALSE),\"Help!\"))","v":""},null,{"$f":"IF(BU14=\"\",\"\",BS14+IF(BU14=\"XX\",VLOOKUP(\"WRONG\",Answers!AI:AJ,2,FALSE),BU14)+BV14)","v":""},{"$f":"Mainframe!U13","v":0},{"$f":"IF(BX14=0,\"\",IF(NOT(ISNA(VLOOKUP(BX14,Answers!AK:AL,2,FALSE))),VLOOKUP(BX14,Answers!AK:AL,2,FALSE),\"Help!\"))","v":""},null,{"$f":"IF(BY14=\"\",\"\",BW14+IF(BY14=\"XX\",VLOOKUP(\"WRONG\",Answers!AK:AL,2,FALSE),BY14)+BZ14)","v":""},{"$f":"Mainframe!V13","v":0},{"$f":"IF(CB14=0,\"\",IF(NOT(ISNA(VLOOKUP(CB14,Answers!AM:AN,2,FALSE))),VLOOKUP(CB14,Answers!AM:AN,2,FALSE),\"Help!\"))","v":""},null,{"$f":"IF(CC14=\"\",\"\",CA14+IF(CC14=\"XX\",VLOOKUP(\"WRONG\",Answers!AM:AN,2,FALSE),CC14)+CD14)","v":""},null,null,"","","","",""]
["[*]",{"$f":"Mainframe!B14","v":0},13,{"$f":"Mainframe!C14","v":0},{"$f":"IF(D15=0,\"\",IF(NOT(ISNA(VLOOKUP(D15,Answers!A:B,2,FALSE))),VLOOKUP(D15,Answers!A:B,2,FALSE),\"Help!\"))","v":""},null,{"$f":"IF(E15=\"\",\"\",IF(E15=\"XX\",VLOOKUP(\"WRONG\",Answers!A:B,2,FALSE),E15)+F15)","v":""},{"$f":"Mainframe!D14","v":0},{"$f":"IF(H15=0,\"\",IF(NOT(ISNA(VLOOKUP(H15,Answers!C:D,2,FALSE))),VLOOKUP(H15,Answers!C:D,2,FALSE),\"Help!\"))","v":""},null,{"$f":"IF(I15=\"\",\"\",G15+IF(I15=\"XX\",VLOOKUP(\"WRONG\",Answers!C:D,2,FALSE),I15)+J15)","v":""},{"$f":"Mainframe!E14","v":0},{"$f":"IF(L15=0,\"\",IF(NOT(ISNA(VLOOKUP(L15,Answers!E:F,2,FALSE))),VLOOKUP(L15,Answers!E:F,2,FALSE),\"Help!\"))","v":""},null,{"$f":"IF(M15=\"\",\"\",K15+IF(M15=\"XX\",VLOOKUP(\"WRONG\",Answers!E:F,2,FALSE),M15)+N15)","v":""},{"$f":"Mainframe!F14","v":0},{"$f":"IF(P15=0,\"\",IF(NOT(ISNA(VLOOKUP(P15,Answers!G:H,2,FALSE))),VLOOKUP(P15,Answers!G:H,2,FALSE),\"Help!\"))","v":""},null,{"$f":"IF(Q15=\"\",\"\",O15+IF(Q15=\"XX\",VLOOKUP(\"WRONG\",Answers!G:H,2,FALSE),Q15)+R15)","v":""},{"$f":"Mainframe!G14","v":0},{"$f":"IF(T15=0,\"\",IF(NOT(ISNA(VLOOKUP(T15,Answers!I:J,2,FALSE))),VLOOKUP(T15,Answers!I:J,2,FALSE),\"Help!\"))","v":""},null,{"$f":"IF(U15=\"\",\"\",S15+IF(U15=\"XX\",VLOOKUP(\"WRONG\",Answers!I:J,2,FALSE),U15)+V15)","v":""},{"$f":"Mainframe!H14","v":0},{"$f":"IF(X15=0,\"\",IF(NOT(ISNA(VLOOKUP(X15,Answers!K:L,2,FALSE))),VLOOKUP(X15,Answers!K:L,2,FALSE),\"Help!\"))","v":""},null,{"$f":"IF(Y15=\"\",\"\",W15+IF(Y15=\"XX\",VLOOKUP(\"WRONG\",Answers!K:L,2,FALSE),Y15)+Z15)","v":""},{"$f":"Mainframe!I14","v":0},{"$f":"IF(AB15=0,\"\",IF(NOT(ISNA(VLOOKUP(AB15,Answers!M:N,2,FALSE))),VLOOKUP(AB15,Answers!M:N,2,FALSE),\"Help!\"))","v":""},null,{"$f":"IF(AC15=\"\",\"\",AA15+IF(AC15=\"XX\",VLOOKUP(\"WRONG\",Answers!M:N,2,FALSE),AC15)+AD15)","v":""},{"$f":"Mainframe!J14","v":0},{"$f":"IF(AF15=0,\"\",IF(NOT(ISNA(VLOOKUP(AF15,Answers!O:P,2,FALSE))),VLOOKUP(AF15,Answers!O:P,2,FALSE),\"Help!\"))","v":""},null,{"$f":"IF(AG15=\"\",\"\",AE15+IF(AG15=\"XX\",VLOOKUP(\"WRONG\",Answers!O:P,2,FALSE),AG15)+AH15)","v":""},{"$f":"Mainframe!K14","v":0},{"$f":"IF(AJ15=0,\"\",IF(NOT(ISNA(VLOOKUP(AJ15,Answers!Q:R,2,FALSE))),VLOOKUP(AJ15,Answers!Q:R,2,FALSE),\"Help!\"))","v":""},null,{"$f":"IF(AK15=\"\",\"\",AI15+IF(AK15=\"XX\",VLOOKUP(\"WRONG\",Answers!Q:R,2,FALSE),AK15)+AL15)","v":""},{"$f":"Mainframe!L14","v":0},{"$f":"IF(AN15=0,\"\",IF(NOT(ISNA(VLOOKUP(AN15,Answers!S:T,2,FALSE))),VLOOKUP(AN15,Answers!S:T,2,FALSE),\"Help!\"))","v":""},null,{"$f":"IF(AO15=\"\",\"\",AM15+IF(AO15=\"XX\",VLOOKUP(\"WRONG\",Answers!S:T,2,FALSE),AO15)+AP15)","v":""},{"$f":"Mainframe!M14","v":0},{"$f":"IF(AR15=0,\"\",IF(NOT(ISNA(VLOOKUP(AR15,Answers!U:V,2,FALSE))),VLOOKUP(AR15,Answers!U:V,2,FALSE),\"Help!\"))","v":""},null,{"$f":"IF(AS15=\"\",\"\",AQ15+IF(AS15=\"XX\",VLOOKUP(\"WRONG\",Answers!U:V,2,FALSE),AS15)+AT15)","v":""},{"$f":"Mainframe!N14","v":0},{"$f":"IF(AV15=0,\"\",IF(NOT(ISNA(VLOOKUP(AV15,Answers!W:X,2,FALSE))),VLOOKUP(AV15,Answers!W:X,2,FALSE),\"Help!\"))","v":""},null,{"$f":"IF(AW15=\"\",\"\",AU15+IF(AW15=\"XX\",VLOOKUP(\"WRONG\",Answers!W:X,2,FALSE),AW15)+AX15)","v":""},{"$f":"Mainframe!O14","v":0},{"$f":"IF(AZ15=0,\"\",IF(NOT(ISNA(VLOOKUP(AZ15,Answers!Y:Z,2,FALSE))),VLOOKUP(AZ15,Answers!Y:Z,2,FALSE),\"Help!\"))","v":""},null,{"$f":"IF(BA15=\"\",\"\",AY15+IF(BA15=\"XX\",VLOOKUP(\"WRONG\",Answers!Y:Z,2,FALSE),BA15)+BB15)","v":""},{"$f":"Mainframe!P14","v":0},{"$f":"IF(BD15=0,\"\",IF(NOT(ISNA(VLOOKUP(BD15,Answers!AA:AB,2,FALSE))),VLOOKUP(BD15,Answers!AA:AB,2,FALSE),\"Help!\"))","v":""},null,{"$f":"IF(BE15=\"\",\"\",BC15+IF(BE15=\"XX\",VLOOKUP(\"WRONG\",Answers!AA:AB,2,FALSE),BE15)+BF15)","v":""},{"$f":"Mainframe!Q14","v":0},{"$f":"IF(BH15=0,\"\",IF(NOT(ISNA(VLOOKUP(BH15,Answers!AC:AD,2,FALSE))),VLOOKUP(BH15,Answers!AC:AD,2,FALSE),\"Help!\"))","v":""},null,{"$f":"IF(BI15=\"\",\"\",BG15+IF(BI15=\"XX\",VLOOKUP(\"WRONG\",Answers!AC:AD,2,FALSE),BI15)+BJ15)","v":""},{"$f":"Mainframe!R14","v":0},{"$f":"IF(BL15=0,\"\",IF(NOT(ISNA(VLOOKUP(BL15,Answers!AE:AF,2,FALSE))),VLOOKUP(BL15,Answers!AE:AF,2,FALSE),\"Help!\"))","v":""},null,{"$f":"IF(BM15=\"\",\"\",BK15+IF(BM15=\"XX\",VLOOKUP(\"WRONG\",Answers!AE:AF,2,FALSE),BM15)+BN15)","v":""},{"$f":"Mainframe!S14","v":0},{"$f":"IF(BP15=0,\"\",IF(NOT(ISNA(VLOOKUP(BP15,Answers!AG:AH,2,FALSE))),VLOOKUP(BP15,Answers!AG:AH,2,FALSE),\"Help!\"))","v":""},null,{"$f":"IF(BQ15=\"\",\"\",BO15+IF(BQ15=\"XX\",VLOOKUP(\"WRONG\",Answers!AG:AH,2,FALSE),BQ15)+BR15)","v":""},{"$f":"Mainframe!T14","v":0},{"$f":"IF(BT15=0,\"\",IF(NOT(ISNA(VLOOKUP(BT15,Answers!AI:AJ,2,FALSE))),VLOOKUP(BT15,Answers!AI:AJ,2,FALSE),\"Help!\"))","v":""},null,{"$f":"IF(BU15=\"\",\"\",BS15+IF(BU15=\"XX\",VLOOKUP(\"WRONG\",Answers!AI:AJ,2,FALSE),BU15)+BV15)","v":""},{"$f":"Mainframe!U14","v":0},{"$f":"IF(BX15=0,\"\",IF(NOT(ISNA(VLOOKUP(BX15,Answers!AK:AL,2,FALSE))),VLOOKUP(BX15,Answers!AK:AL,2,FALSE),\"Help!\"))","v":""},null,{"$f":"IF(BY15=\"\",\"\",BW15+IF(BY15=\"XX\",VLOOKUP(\"WRONG\",Answers!AK:AL,2,FALSE),BY15)+BZ15)","v":""},{"$f":"Mainframe!V14","v":0},{"$f":"IF(CB15=0,\"\",IF(NOT(ISNA(VLOOKUP(CB15,Answers!AM:AN,2,FALSE))),VLOOKUP(CB15,Answers!AM:AN,2,FALSE),\"Help!\"))","v":""},null,{"$f":"IF(CC15=\"\",\"\",CA15+IF(CC15=\"XX\",VLOOKUP(\"WRONG\",Answers!AM:AN,2,FALSE),CC15)+CD15)","v":""},null,null,"","","","",""]
["[*]",{"$f":"Mainframe!B15","v":0},14,{"$f":"Mainframe!C15","v":0},{"$f":"IF(D16=0,\"\",IF(NOT(ISNA(VLOOKUP(D16,Answers!A:B,2,FALSE))),VLOOKUP(D16,Answers!A:B,2,FALSE),\"Help!\"))","v":""},null,{"$f":"IF(E16=\"\",\"\",IF(E16=\"XX\",VLOOKUP(\"WRONG\",Answers!A:B,2,FALSE),E16)+F16)","v":""},{"$f":"Mainframe!D15","v":0},{"$f":"IF(H16=0,\"\",IF(NOT(ISNA(VLOOKUP(H16,Answers!C:D,2,FALSE))),VLOOKUP(H16,Answers!C:D,2,FALSE),\"Help!\"))","v":""},null,{"$f":"IF(I16=\"\",\"\",G16+IF(I16=\"XX\",VLOOKUP(\"WRONG\",Answers!C:D,2,FALSE),I16)+J16)","v":""},{"$f":"Mainframe!E15","v":0},{"$f":"IF(L16=0,\"\",IF(NOT(ISNA(VLOOKUP(L16,Answers!E:F,2,FALSE))),VLOOKUP(L16,Answers!E:F,2,FALSE),\"Help!\"))","v":""},null,{"$f":"IF(M16=\"\",\"\",K16+IF(M16=\"XX\",VLOOKUP(\"WRONG\",Answers!E:F,2,FALSE),M16)+N16)","v":""},{"$f":"Mainframe!F15","v":0},{"$f":"IF(P16=0,\"\",IF(NOT(ISNA(VLOOKUP(P16,Answers!G:H,2,FALSE))),VLOOKUP(P16,Answers!G:H,2,FALSE),\"Help!\"))","v":""},null,{"$f":"IF(Q16=\"\",\"\",O16+IF(Q16=\"XX\",VLOOKUP(\"WRONG\",Answers!G:H,2,FALSE),Q16)+R16)","v":""},{"$f":"Mainframe!G15","v":0},{"$f":"IF(T16=0,\"\",IF(NOT(ISNA(VLOOKUP(T16,Answers!I:J,2,FALSE))),VLOOKUP(T16,Answers!I:J,2,FALSE),\"Help!\"))","v":""},null,{"$f":"IF(U16=\"\",\"\",S16+IF(U16=\"XX\",VLOOKUP(\"WRONG\",Answers!I:J,2,FALSE),U16)+V16)","v":""},{"$f":"Mainframe!H15","v":0},{"$f":"IF(X16=0,\"\",IF(NOT(ISNA(VLOOKUP(X16,Answers!K:L,2,FALSE))),VLOOKUP(X16,Answers!K:L,2,FALSE),\"Help!\"))","v":""},null,{"$f":"IF(Y16=\"\",\"\",W16+IF(Y16=\"XX\",VLOOKUP(\"WRONG\",Answers!K:L,2,FALSE),Y16)+Z16)","v":""},{"$f":"Mainframe!I15","v":0},{"$f":"IF(AB16=0,\"\",IF(NOT(ISNA(VLOOKUP(AB16,Answers!M:N,2,FALSE))),VLOOKUP(AB16,Answers!M:N,2,FALSE),\"Help!\"))","v":""},null,{"$f":"IF(AC16=\"\",\"\",AA16+IF(AC16=\"XX\",VLOOKUP(\"WRONG\",Answers!M:N,2,FALSE),AC16)+AD16)","v":""},{"$f":"Mainframe!J15","v":0},{"$f":"IF(AF16=0,\"\",IF(NOT(ISNA(VLOOKUP(AF16,Answers!O:P,2,FALSE))),VLOOKUP(AF16,Answers!O:P,2,FALSE),\"Help!\"))","v":""},null,{"$f":"IF(AG16=\"\",\"\",AE16+IF(AG16=\"XX\",VLOOKUP(\"WRONG\",Answers!O:P,2,FALSE),AG16)+AH16)","v":""},{"$f":"Mainframe!K15","v":0},{"$f":"IF(AJ16=0,\"\",IF(NOT(ISNA(VLOOKUP(AJ16,Answers!Q:R,2,FALSE))),VLOOKUP(AJ16,Answers!Q:R,2,FALSE),\"Help!\"))","v":""},null,{"$f":"IF(AK16=\"\",\"\",AI16+IF(AK16=\"XX\",VLOOKUP(\"WRONG\",Answers!Q:R,2,FALSE),AK16)+AL16)","v":""},{"$f":"Mainframe!L15","v":0},{"$f":"IF(AN16=0,\"\",IF(NOT(ISNA(VLOOKUP(AN16,Answers!S:T,2,FALSE))),VLOOKUP(AN16,Answers!S:T,2,FALSE),\"Help!\"))","v":""},null,{"$f":"IF(AO16=\"\",\"\",AM16+IF(AO16=\"XX\",VLOOKUP(\"WRONG\",Answers!S:T,2,FALSE),AO16)+AP16)","v":""},{"$f":"Mainframe!M15","v":0},{"$f":"IF(AR16=0,\"\",IF(NOT(ISNA(VLOOKUP(AR16,Answers!U:V,2,FALSE))),VLOOKUP(AR16,Answers!U:V,2,FALSE),\"Help!\"))","v":""},null,{"$f":"IF(AS16=\"\",\"\",AQ16+IF(AS16=\"XX\",VLOOKUP(\"WRONG\",Answers!U:V,2,FALSE),AS16)+AT16)","v":""},{"$f":"Mainframe!N15","v":0},{"$f":"IF(AV16=0,\"\",IF(NOT(ISNA(VLOOKUP(AV16,Answers!W:X,2,FALSE))),VLOOKUP(AV16,Answers!W:X,2,FALSE),\"Help!\"))","v":""},null,{"$f":"IF(AW16=\"\",\"\",AU16+IF(AW16=\"XX\",VLOOKUP(\"WRONG\",Answers!W:X,2,FALSE),AW16)+AX16)","v":""},{"$f":"Mainframe!O15","v":0},{"$f":"IF(AZ16=0,\"\",IF(NOT(ISNA(VLOOKUP(AZ16,Answers!Y:Z,2,FALSE))),VLOOKUP(AZ16,Answers!Y:Z,2,FALSE),\"Help!\"))","v":""},null,{"$f":"IF(BA16=\"\",\"\",AY16+IF(BA16=\"XX\",VLOOKUP(\"WRONG\",Answers!Y:Z,2,FALSE),BA16)+BB16)","v":""},{"$f":"Mainframe!P15","v":0},{"$f":"IF(BD16=0,\"\",IF(NOT(ISNA(VLOOKUP(BD16,Answers!AA:AB,2,FALSE))),VLOOKUP(BD16,Answers!AA:AB,2,FALSE),\"Help!\"))","v":""},null,{"$f":"IF(BE16=\"\",\"\",BC16+IF(BE16=\"XX\",VLOOKUP(\"WRONG\",Answers!AA:AB,2,FALSE),BE16)+BF16)","v":""},{"$f":"Mainframe!Q15","v":0},{"$f":"IF(BH16=0,\"\",IF(NOT(ISNA(VLOOKUP(BH16,Answers!AC:AD,2,FALSE))),VLOOKUP(BH16,Answers!AC:AD,2,FALSE),\"Help!\"))","v":""},null,{"$f":"IF(BI16=\"\",\"\",BG16+IF(BI16=\"XX\",VLOOKUP(\"WRONG\",Answers!AC:AD,2,FALSE),BI16)+BJ16)","v":""},{"$f":"Mainframe!R15","v":0},{"$f":"IF(BL16=0,\"\",IF(NOT(ISNA(VLOOKUP(BL16,Answers!AE:AF,2,FALSE))),VLOOKUP(BL16,Answers!AE:AF,2,FALSE),\"Help!\"))","v":""},null,{"$f":"IF(BM16=\"\",\"\",BK16+IF(BM16=\"XX\",VLOOKUP(\"WRONG\",Answers!AE:AF,2,FALSE),BM16)+BN16)","v":""},{"$f":"Mainframe!S15","v":0},{"$f":"IF(BP16=0,\"\",IF(NOT(ISNA(VLOOKUP(BP16,Answers!AG:AH,2,FALSE))),VLOOKUP(BP16,Answers!AG:AH,2,FALSE),\"Help!\"))","v":""},null,{"$f":"IF(BQ16=\"\",\"\",BO16+IF(BQ16=\"XX\",VLOOKUP(\"WRONG\",Answers!AG:AH,2,FALSE),BQ16)+BR16)","v":""},{"$f":"Mainframe!T15","v":0},{"$f":"IF(BT16=0,\"\",IF(NOT(ISNA(VLOOKUP(BT16,Answers!AI:AJ,2,FALSE))),VLOOKUP(BT16,Answers!AI:AJ,2,FALSE),\"Help!\"))","v":""},null,{"$f":"IF(BU16=\"\",\"\",BS16+IF(BU16=\"XX\",VLOOKUP(\"WRONG\",Answers!AI:AJ,2,FALSE),BU16)+BV16)","v":""},{"$f":"Mainframe!U15","v":0},{"$f":"IF(BX16=0,\"\",IF(NOT(ISNA(VLOOKUP(BX16,Answers!AK:AL,2,FALSE))),VLOOKUP(BX16,Answers!AK:AL,2,FALSE),\"Help!\"))","v":""},null,{"$f":"IF(BY16=\"\",\"\",BW16+IF(BY16=\"XX\",VLOOKUP(\"WRONG\",Answers!AK:AL,2,FALSE),BY16)+BZ16)","v":""},{"$f":"Mainframe!V15","v":0},{"$f":"IF(CB16=0,\"\",IF(NOT(ISNA(VLOOKUP(CB16,Answers!AM:AN,2,FALSE))),VLOOKUP(CB16,Answers!AM:AN,2,FALSE),\"Help!\"))","v":""},null,{"$f":"IF(CC16=\"\",\"\",CA16+IF(CC16=\"XX\",VLOOKUP(\"WRONG\",Answers!AM:AN,2,FALSE),CC16)+CD16)","v":""},null,null,"","","","",""]
["[*]",{"$f":"Mainframe!B16","v":0},15,{"$f":"Mainframe!C16","v":0},{"$f":"IF(D17=0,\"\",IF(NOT(ISNA(VLOOKUP(D17,Answers!A:B,2,FALSE))),VLOOKUP(D17,Answers!A:B,2,FALSE),\"Help!\"))","v":""},null,{"$f":"IF(E17=\"\",\"\",IF(E17=\"XX\",VLOOKUP(\"WRONG\",Answers!A:B,2,FALSE),E17)+F17)","v":""},{"$f":"Mainframe!D16","v":0},{"$f":"IF(H17=0,\"\",IF(NOT(ISNA(VLOOKUP(H17,Answers!C:D,2,FALSE))),VLOOKUP(H17,Answers!C:D,2,FALSE),\"Help!\"))","v":""},null,{"$f":"IF(I17=\"\",\"\",G17+IF(I17=\"XX\",VLOOKUP(\"WRONG\",Answers!C:D,2,FALSE),I17)+J17)","v":""},{"$f":"Mainframe!E16","v":0},{"$f":"IF(L17=0,\"\",IF(NOT(ISNA(VLOOKUP(L17,Answers!E:F,2,FALSE))),VLOOKUP(L17,Answers!E:F,2,FALSE),\"Help!\"))","v":""},null,{"$f":"IF(M17=\"\",\"\",K17+IF(M17=\"XX\",VLOOKUP(\"WRONG\",Answers!E:F,2,FALSE),M17)+N17)","v":""},{"$f":"Mainframe!F16","v":0},{"$f":"IF(P17=0,\"\",IF(NOT(ISNA(VLOOKUP(P17,Answers!G:H,2,FALSE))),VLOOKUP(P17,Answers!G:H,2,FALSE),\"Help!\"))","v":""},null,{"$f":"IF(Q17=\"\",\"\",O17+IF(Q17=\"XX\",VLOOKUP(\"WRONG\",Answers!G:H,2,FALSE),Q17)+R17)","v":""},{"$f":"Mainframe!G16","v":0},{"$f":"IF(T17=0,\"\",IF(NOT(ISNA(VLOOKUP(T17,Answers!I:J,2,FALSE))),VLOOKUP(T17,Answers!I:J,2,FALSE),\"Help!\"))","v":""},null,{"$f":"IF(U17=\"\",\"\",S17+IF(U17=\"XX\",VLOOKUP(\"WRONG\",Answers!I:J,2,FALSE),U17)+V17)","v":""},{"$f":"Mainframe!H16","v":0},{"$f":"IF(X17=0,\"\",IF(NOT(ISNA(VLOOKUP(X17,Answers!K:L,2,FALSE))),VLOOKUP(X17,Answers!K:L,2,FALSE),\"Help!\"))","v":""},null,{"$f":"IF(Y17=\"\",\"\",W17+IF(Y17=\"XX\",VLOOKUP(\"WRONG\",Answers!K:L,2,FALSE),Y17)+Z17)","v":""},{"$f":"Mainframe!I16","v":0},{"$f":"IF(AB17=0,\"\",IF(NOT(ISNA(VLOOKUP(AB17,Answers!M:N,2,FALSE))),VLOOKUP(AB17,Answers!M:N,2,FALSE),\"Help!\"))","v":""},null,{"$f":"IF(AC17=\"\",\"\",AA17+IF(AC17=\"XX\",VLOOKUP(\"WRONG\",Answers!M:N,2,FALSE),AC17)+AD17)","v":""},{"$f":"Mainframe!J16","v":0},{"$f":"IF(AF17=0,\"\",IF(NOT(ISNA(VLOOKUP(AF17,Answers!O:P,2,FALSE))),VLOOKUP(AF17,Answers!O:P,2,FALSE),\"Help!\"))","v":""},null,{"$f":"IF(AG17=\"\",\"\",AE17+IF(AG17=\"XX\",VLOOKUP(\"WRONG\",Answers!O:P,2,FALSE),AG17)+AH17)","v":""},{"$f":"Mainframe!K16","v":0},{"$f":"IF(AJ17=0,\"\",IF(NOT(ISNA(VLOOKUP(AJ17,Answers!Q:R,2,FALSE))),VLOOKUP(AJ17,Answers!Q:R,2,FALSE),\"Help!\"))","v":""},null,{"$f":"IF(AK17=\"\",\"\",AI17+IF(AK17=\"XX\",VLOOKUP(\"WRONG\",Answers!Q:R,2,FALSE),AK17)+AL17)","v":""},{"$f":"Mainframe!L16","v":0},{"$f":"IF(AN17=0,\"\",IF(NOT(ISNA(VLOOKUP(AN17,Answers!S:T,2,FALSE))),VLOOKUP(AN17,Answers!S:T,2,FALSE),\"Help!\"))","v":""},null,{"$f":"IF(AO17=\"\",\"\",AM17+IF(AO17=\"XX\",VLOOKUP(\"WRONG\",Answers!S:T,2,FALSE),AO17)+AP17)","v":""},{"$f":"Mainframe!M16","v":0},{"$f":"IF(AR17=0,\"\",IF(NOT(ISNA(VLOOKUP(AR17,Answers!U:V,2,FALSE))),VLOOKUP(AR17,Answers!U:V,2,FALSE),\"Help!\"))","v":""},null,{"$f":"IF(AS17=\"\",\"\",AQ17+IF(AS17=\"XX\",VLOOKUP(\"WRONG\",Answers!U:V,2,FALSE),AS17)+AT17)","v":""},{"$f":"Mainframe!N16","v":0},{"$f":"IF(AV17=0,\"\",IF(NOT(ISNA(VLOOKUP(AV17,Answers!W:X,2,FALSE))),VLOOKUP(AV17,Answers!W:X,2,FALSE),\"Help!\"))","v":""},null,{"$f":"IF(AW17=\"\",\"\",AU17+IF(AW17=\"XX\",VLOOKUP(\"WRONG\",Answers!W:X,2,FALSE),AW17)+AX17)","v":""},{"$f":"Mainframe!O16","v":0},{"$f":"IF(AZ17=0,\"\",IF(NOT(ISNA(VLOOKUP(AZ17,Answers!Y:Z,2,FALSE))),VLOOKUP(AZ17,Answers!Y:Z,2,FALSE),\"Help!\"))","v":""},null,{"$f":"IF(BA17=\"\",\"\",AY17+IF(BA17=\"XX\",VLOOKUP(\"WRONG\",Answers!Y:Z,2,FALSE),BA17)+BB17)","v":""},{"$f":"Mainframe!P16","v":0},{"$f":"IF(BD17=0,\"\",IF(NOT(ISNA(VLOOKUP(BD17,Answers!AA:AB,2,FALSE))),VLOOKUP(BD17,Answers!AA:AB,2,FALSE),\"Help!\"))","v":""},null,{"$f":"IF(BE17=\"\",\"\",BC17+IF(BE17=\"XX\",VLOOKUP(\"WRONG\",Answers!AA:AB,2,FALSE),BE17)+BF17)","v":""},{"$f":"Mainframe!Q16","v":0},{"$f":"IF(BH17=0,\"\",IF(NOT(ISNA(VLOOKUP(BH17,Answers!AC:AD,2,FALSE))),VLOOKUP(BH17,Answers!AC:AD,2,FALSE),\"Help!\"))","v":""},null,{"$f":"IF(BI17=\"\",\"\",BG17+IF(BI17=\"XX\",VLOOKUP(\"WRONG\",Answers!AC:AD,2,FALSE),BI17)+BJ17)","v":""},{"$f":"Mainframe!R16","v":0},{"$f":"IF(BL17=0,\"\",IF(NOT(ISNA(VLOOKUP(BL17,Answers!AE:AF,2,FALSE))),VLOOKUP(BL17,Answers!AE:AF,2,FALSE),\"Help!\"))","v":""},null,{"$f":"IF(BM17=\"\",\"\",BK17+IF(BM17=\"XX\",VLOOKUP(\"WRONG\",Answers!AE:AF,2,FALSE),BM17)+BN17)","v":""},{"$f":"Mainframe!S16","v":0},{"$f":"IF(BP17=0,\"\",IF(NOT(ISNA(VLOOKUP(BP17,Answers!AG:AH,2,FALSE))),VLOOKUP(BP17,Answers!AG:AH,2,FALSE),\"Help!\"))","v":""},null,{"$f":"IF(BQ17=\"\",\"\",BO17+IF(BQ17=\"XX\",VLOOKUP(\"WRONG\",Answers!AG:AH,2,FALSE),BQ17)+BR17)","v":""},{"$f":"Mainframe!T16","v":0},{"$f":"IF(BT17=0,\"\",IF(NOT(ISNA(VLOOKUP(BT17,Answers!AI:AJ,2,FALSE))),VLOOKUP(BT17,Answers!AI:AJ,2,FALSE),\"Help!\"))","v":""},null,{"$f":"IF(BU17=\"\",\"\",BS17+IF(BU17=\"XX\",VLOOKUP(\"WRONG\",Answers!AI:AJ,2,FALSE),BU17)+BV17)","v":""},{"$f":"Mainframe!U16","v":0},{"$f":"IF(BX17=0,\"\",IF(NOT(ISNA(VLOOKUP(BX17,Answers!AK:AL,2,FALSE))),VLOOKUP(BX17,Answers!AK:AL,2,FALSE),\"Help!\"))","v":""},null,{"$f":"IF(BY17=\"\",\"\",BW17+IF(BY17=\"XX\",VLOOKUP(\"WRONG\",Answers!AK:AL,2,FALSE),BY17)+BZ17)","v":""},{"$f":"Mainframe!V16","v":0},{"$f":"IF(CB17=0,\"\",IF(NOT(ISNA(VLOOKUP(CB17,Answers!AM:AN,2,FALSE))),VLOOKUP(CB17,Answers!AM:AN,2,FALSE),\"Help!\"))","v":""},null,{"$f":"IF(CC17=\"\",\"\",CA17+IF(CC17=\"XX\",VLOOKUP(\"WRONG\",Answers!AM:AN,2,FALSE),CC17)+CD17)","v":""},null,null,"","","","",""]
["[*]",{"$f":"Mainframe!B17","v":0},16,{"$f":"Mainframe!C17","v":0},{"$f":"IF(D18=0,\"\",IF(NOT(ISNA(VLOOKUP(D18,Answers!A:B,2,FALSE))),VLOOKUP(D18,Answers!A:B,2,FALSE),\"Help!\"))","v":""},null,{"$f":"IF(E18=\"\",\"\",IF(E18=\"XX\",VLOOKUP(\"WRONG\",Answers!A:B,2,FALSE),E18)+F18)","v":""},{"$f":"Mainframe!D17","v":0},{"$f":"IF(H18=0,\"\",IF(NOT(ISNA(VLOOKUP(H18,Answers!C:D,2,FALSE))),VLOOKUP(H18,Answers!C:D,2,FALSE),\"Help!\"))","v":""},null,{"$f":"IF(I18=\"\",\"\",G18+IF(I18=\"XX\",VLOOKUP(\"WRONG\",Answers!C:D,2,FALSE),I18)+J18)","v":""},{"$f":"Mainframe!E17","v":0},{"$f":"IF(L18=0,\"\",IF(NOT(ISNA(VLOOKUP(L18,Answers!E:F,2,FALSE))),VLOOKUP(L18,Answers!E:F,2,FALSE),\"Help!\"))","v":""},null,{"$f":"IF(M18=\"\",\"\",K18+IF(M18=\"XX\",VLOOKUP(\"WRONG\",Answers!E:F,2,FALSE),M18)+N18)","v":""},{"$f":"Mainframe!F17","v":0},{"$f":"IF(P18=0,\"\",IF(NOT(ISNA(VLOOKUP(P18,Answers!G:H,2,FALSE))),VLOOKUP(P18,Answers!G:H,2,FALSE),\"Help!\"))","v":""},null,{"$f":"IF(Q18=\"\",\"\",O18+IF(Q18=\"XX\",VLOOKUP(\"WRONG\",Answers!G:H,2,FALSE),Q18)+R18)","v":""},{"$f":"Mainframe!G17","v":0},{"$f":"IF(T18=0,\"\",IF(NOT(ISNA(VLOOKUP(T18,Answers!I:J,2,FALSE))),VLOOKUP(T18,Answers!I:J,2,FALSE),\"Help!\"))","v":""},null,{"$f":"IF(U18=\"\",\"\",S18+IF(U18=\"XX\",VLOOKUP(\"WRONG\",Answers!I:J,2,FALSE),U18)+V18)","v":""},{"$f":"Mainframe!H17","v":0},{"$f":"IF(X18=0,\"\",IF(NOT(ISNA(VLOOKUP(X18,Answers!K:L,2,FALSE))),VLOOKUP(X18,Answers!K:L,2,FALSE),\"Help!\"))","v":""},null,{"$f":"IF(Y18=\"\",\"\",W18+IF(Y18=\"XX\",VLOOKUP(\"WRONG\",Answers!K:L,2,FALSE),Y18)+Z18)","v":""},{"$f":"Mainframe!I17","v":0},{"$f":"IF(AB18=0,\"\",IF(NOT(ISNA(VLOOKUP(AB18,Answers!M:N,2,FALSE))),VLOOKUP(AB18,Answers!M:N,2,FALSE),\"Help!\"))","v":""},null,{"$f":"IF(AC18=\"\",\"\",AA18+IF(AC18=\"XX\",VLOOKUP(\"WRONG\",Answers!M:N,2,FALSE),AC18)+AD18)","v":""},{"$f":"Mainframe!J17","v":0},{"$f":"IF(AF18=0,\"\",IF(NOT(ISNA(VLOOKUP(AF18,Answers!O:P,2,FALSE))),VLOOKUP(AF18,Answers!O:P,2,FALSE),\"Help!\"))","v":""},null,{"$f":"IF(AG18=\"\",\"\",AE18+IF(AG18=\"XX\",VLOOKUP(\"WRONG\",Answers!O:P,2,FALSE),AG18)+AH18)","v":""},{"$f":"Mainframe!K17","v":0},{"$f":"IF(AJ18=0,\"\",IF(NOT(ISNA(VLOOKUP(AJ18,Answers!Q:R,2,FALSE))),VLOOKUP(AJ18,Answers!Q:R,2,FALSE),\"Help!\"))","v":""},null,{"$f":"IF(AK18=\"\",\"\",AI18+IF(AK18=\"XX\",VLOOKUP(\"WRONG\",Answers!Q:R,2,FALSE),AK18)+AL18)","v":""},{"$f":"Mainframe!L17","v":0},{"$f":"IF(AN18=0,\"\",IF(NOT(ISNA(VLOOKUP(AN18,Answers!S:T,2,FALSE))),VLOOKUP(AN18,Answers!S:T,2,FALSE),\"Help!\"))","v":""},null,{"$f":"IF(AO18=\"\",\"\",AM18+IF(AO18=\"XX\",VLOOKUP(\"WRONG\",Answers!S:T,2,FALSE),AO18)+AP18)","v":""},{"$f":"Mainframe!M17","v":0},{"$f":"IF(AR18=0,\"\",IF(NOT(ISNA(VLOOKUP(AR18,Answers!U:V,2,FALSE))),VLOOKUP(AR18,Answers!U:V,2,FALSE),\"Help!\"))","v":""},null,{"$f":"IF(AS18=\"\",\"\",AQ18+IF(AS18=\"XX\",VLOOKUP(\"WRONG\",Answers!U:V,2,FALSE),AS18)+AT18)","v":""},{"$f":"Mainframe!N17","v":0},{"$f":"IF(AV18=0,\"\",IF(NOT(ISNA(VLOOKUP(AV18,Answers!W:X,2,FALSE))),VLOOKUP(AV18,Answers!W:X,2,FALSE),\"Help!\"))","v":""},null,{"$f":"IF(AW18=\"\",\"\",AU18+IF(AW18=\"XX\",VLOOKUP(\"WRONG\",Answers!W:X,2,FALSE),AW18)+AX18)","v":""},{"$f":"Mainframe!O17","v":0},{"$f":"IF(AZ18=0,\"\",IF(NOT(ISNA(VLOOKUP(AZ18,Answers!Y:Z,2,FALSE))),VLOOKUP(AZ18,Answers!Y:Z,2,FALSE),\"Help!\"))","v":""},null,{"$f":"IF(BA18=\"\",\"\",AY18+IF(BA18=\"XX\",VLOOKUP(\"WRONG\",Answers!Y:Z,2,FALSE),BA18)+BB18)","v":""},{"$f":"Mainframe!P17","v":0},{"$f":"IF(BD18=0,\"\",IF(NOT(ISNA(VLOOKUP(BD18,Answers!AA:AB,2,FALSE))),VLOOKUP(BD18,Answers!AA:AB,2,FALSE),\"Help!\"))","v":""},null,{"$f":"IF(BE18=\"\",\"\",BC18+IF(BE18=\"XX\",VLOOKUP(\"WRONG\",Answers!AA:AB,2,FALSE),BE18)+BF18)","v":""},{"$f":"Mainframe!Q17","v":0},{"$f":"IF(BH18=0,\"\",IF(NOT(ISNA(VLOOKUP(BH18,Answers!AC:AD,2,FALSE))),VLOOKUP(BH18,Answers!AC:AD,2,FALSE),\"Help!\"))","v":""},null,{"$f":"IF(BI18=\"\",\"\",BG18+IF(BI18=\"XX\",VLOOKUP(\"WRONG\",Answers!AC:AD,2,FALSE),BI18)+BJ18)","v":""},{"$f":"Mainframe!R17","v":0},{"$f":"IF(BL18=0,\"\",IF(NOT(ISNA(VLOOKUP(BL18,Answers!AE:AF,2,FALSE))),VLOOKUP(BL18,Answers!AE:AF,2,FALSE),\"Help!\"))","v":""},null,{"$f":"IF(BM18=\"\",\"\",BK18+IF(BM18=\"XX\",VLOOKUP(\"WRONG\",Answers!AE:AF,2,FALSE),BM18)+BN18)","v":""},{"$f":"Mainframe!S17","v":0},{"$f":"IF(BP18=0,\"\",IF(NOT(ISNA(VLOOKUP(BP18,Answers!AG:AH,2,FALSE))),VLOOKUP(BP18,Answers!AG:AH,2,FALSE),\"Help!\"))","v":""},null,{"$f":"IF(BQ18=\"\",\"\",BO18+IF(BQ18=\"XX\",VLOOKUP(\"WRONG\",Answers!AG:AH,2,FALSE),BQ18)+BR18)","v":""},{"$f":"Mainframe!T17","v":0},{"$f":"IF(BT18=0,\"\",IF(NOT(ISNA(VLOOKUP(BT18,Answers!AI:AJ,2,FALSE))),VLOOKUP(BT18,Answers!AI:AJ,2,FALSE),\"Help!\"))","v":""},null,{"$f":"IF(BU18=\"\",\"\",BS18+IF(BU18=\"XX\",VLOOKUP(\"WRONG\",Answers!AI:AJ,2,FALSE),BU18)+BV18)","v":""},{"$f":"Mainframe!U17","v":0},{"$f":"IF(BX18=0,\"\",IF(NOT(ISNA(VLOOKUP(BX18,Answers!AK:AL,2,FALSE))),VLOOKUP(BX18,Answers!AK:AL,2,FALSE),\"Help!\"))","v":""},null,{"$f":"IF(BY18=\"\",\"\",BW18+IF(BY18=\"XX\",VLOOKUP(\"WRONG\",Answers!AK:AL,2,FALSE),BY18)+BZ18)","v":""},{"$f":"Mainframe!V17","v":0},{"$f":"IF(CB18=0,\"\",IF(NOT(ISNA(VLOOKUP(CB18,Answers!AM:AN,2,FALSE))),VLOOKUP(CB18,Answers!AM:AN,2,FALSE),\"Help!\"))","v":""},null,{"$f":"IF(CC18=\"\",\"\",CA18+IF(CC18=\"XX\",VLOOKUP(\"WRONG\",Answers!AM:AN,2,FALSE),CC18)+CD18)","v":""},null,null,"","","","",""]
["[*]",{"$f":"Mainframe!B18","v":0},17,{"$f":"Mainframe!C18","v":0},{"$f":"IF(D19=0,\"\",IF(NOT(ISNA(VLOOKUP(D19,Answers!A:B,2,FALSE))),VLOOKUP(D19,Answers!A:B,2,FALSE),\"Help!\"))","v":""},null,{"$f":"IF(E19=\"\",\"\",IF(E19=\"XX\",VLOOKUP(\"WRONG\",Answers!A:B,2,FALSE),E19)+F19)","v":""},{"$f":"Mainframe!D18","v":0},{"$f":"IF(H19=0,\"\",IF(NOT(ISNA(VLOOKUP(H19,Answers!C:D,2,FALSE))),VLOOKUP(H19,Answers!C:D,2,FALSE),\"Help!\"))","v":""},null,{"$f":"IF(I19=\"\",\"\",G19+IF(I19=\"XX\",VLOOKUP(\"WRONG\",Answers!C:D,2,FALSE),I19)+J19)","v":""},{"$f":"Mainframe!E18","v":0},{"$f":"IF(L19=0,\"\",IF(NOT(ISNA(VLOOKUP(L19,Answers!E:F,2,FALSE))),VLOOKUP(L19,Answers!E:F,2,FALSE),\"Help!\"))","v":""},null,{"$f":"IF(M19=\"\",\"\",K19+IF(M19=\"XX\",VLOOKUP(\"WRONG\",Answers!E:F,2,FALSE),M19)+N19)","v":""},{"$f":"Mainframe!F18","v":0},{"$f":"IF(P19=0,\"\",IF(NOT(ISNA(VLOOKUP(P19,Answers!G:H,2,FALSE))),VLOOKUP(P19,Answers!G:H,2,FALSE),\"Help!\"))","v":""},null,{"$f":"IF(Q19=\"\",\"\",O19+IF(Q19=\"XX\",VLOOKUP(\"WRONG\",Answers!G:H,2,FALSE),Q19)+R19)","v":""},{"$f":"Mainframe!G18","v":0},{"$f":"IF(T19=0,\"\",IF(NOT(ISNA(VLOOKUP(T19,Answers!I:J,2,FALSE))),VLOOKUP(T19,Answers!I:J,2,FALSE),\"Help!\"))","v":""},null,{"$f":"IF(U19=\"\",\"\",S19+IF(U19=\"XX\",VLOOKUP(\"WRONG\",Answers!I:J,2,FALSE),U19)+V19)","v":""},{"$f":"Mainframe!H18","v":0},{"$f":"IF(X19=0,\"\",IF(NOT(ISNA(VLOOKUP(X19,Answers!K:L,2,FALSE))),VLOOKUP(X19,Answers!K:L,2,FALSE),\"Help!\"))","v":""},null,{"$f":"IF(Y19=\"\",\"\",W19+IF(Y19=\"XX\",VLOOKUP(\"WRONG\",Answers!K:L,2,FALSE),Y19)+Z19)","v":""},{"$f":"Mainframe!I18","v":0},{"$f":"IF(AB19=0,\"\",IF(NOT(ISNA(VLOOKUP(AB19,Answers!M:N,2,FALSE))),VLOOKUP(AB19,Answers!M:N,2,FALSE),\"Help!\"))","v":""},null,{"$f":"IF(AC19=\"\",\"\",AA19+IF(AC19=\"XX\",VLOOKUP(\"WRONG\",Answers!M:N,2,FALSE),AC19)+AD19)","v":""},{"$f":"Mainframe!J18","v":0},{"$f":"IF(AF19=0,\"\",IF(NOT(ISNA(VLOOKUP(AF19,Answers!O:P,2,FALSE))),VLOOKUP(AF19,Answers!O:P,2,FALSE),\"Help!\"))","v":""},null,{"$f":"IF(AG19=\"\",\"\",AE19+IF(AG19=\"XX\",VLOOKUP(\"WRONG\",Answers!O:P,2,FALSE),AG19)+AH19)","v":""},{"$f":"Mainframe!K18","v":0},{"$f":"IF(AJ19=0,\"\",IF(NOT(ISNA(VLOOKUP(AJ19,Answers!Q:R,2,FALSE))),VLOOKUP(AJ19,Answers!Q:R,2,FALSE),\"Help!\"))","v":""},null,{"$f":"IF(AK19=\"\",\"\",AI19+IF(AK19=\"XX\",VLOOKUP(\"WRONG\",Answers!Q:R,2,FALSE),AK19)+AL19)","v":""},{"$f":"Mainframe!L18","v":0},{"$f":"IF(AN19=0,\"\",IF(NOT(ISNA(VLOOKUP(AN19,Answers!S:T,2,FALSE))),VLOOKUP(AN19,Answers!S:T,2,FALSE),\"Help!\"))","v":""},null,{"$f":"IF(AO19=\"\",\"\",AM19+IF(AO19=\"XX\",VLOOKUP(\"WRONG\",Answers!S:T,2,FALSE),AO19)+AP19)","v":""},{"$f":"Mainframe!M18","v":0},{"$f":"IF(AR19=0,\"\",IF(NOT(ISNA(VLOOKUP(AR19,Answers!U:V,2,FALSE))),VLOOKUP(AR19,Answers!U:V,2,FALSE),\"Help!\"))","v":""},null,{"$f":"IF(AS19=\"\",\"\",AQ19+IF(AS19=\"XX\",VLOOKUP(\"WRONG\",Answers!U:V,2,FALSE),AS19)+AT19)","v":""},{"$f":"Mainframe!N18","v":0},{"$f":"IF(AV19=0,\"\",IF(NOT(ISNA(VLOOKUP(AV19,Answers!W:X,2,FALSE))),VLOOKUP(AV19,Answers!W:X,2,FALSE),\"Help!\"))","v":""},null,{"$f":"IF(AW19=\"\",\"\",AU19+IF(AW19=\"XX\",VLOOKUP(\"WRONG\",Answers!W:X,2,FALSE),AW19)+AX19)","v":""},{"$f":"Mainframe!O18","v":0},{"$f":"IF(AZ19=0,\"\",IF(NOT(ISNA(VLOOKUP(AZ19,Answers!Y:Z,2,FALSE))),VLOOKUP(AZ19,Answers!Y:Z,2,FALSE),\"Help!\"))","v":""},null,{"$f":"IF(BA19=\"\",\"\",AY19+IF(BA19=\"XX\",VLOOKUP(\"WRONG\",Answers!Y:Z,2,FALSE),BA19)+BB19)","v":""},{"$f":"Mainframe!P18","v":0},{"$f":"IF(BD19=0,\"\",IF(NOT(ISNA(VLOOKUP(BD19,Answers!AA:AB,2,FALSE))),VLOOKUP(BD19,Answers!AA:AB,2,FALSE),\"Help!\"))","v":""},null,{"$f":"IF(BE19=\"\",\"\",BC19+IF(BE19=\"XX\",VLOOKUP(\"WRONG\",Answers!AA:AB,2,FALSE),BE19)+BF19)","v":""},{"$f":"Mainframe!Q18","v":0},{"$f":"IF(BH19=0,\"\",IF(NOT(ISNA(VLOOKUP(BH19,Answers!AC:AD,2,FALSE))),VLOOKUP(BH19,Answers!AC:AD,2,FALSE),\"Help!\"))","v":""},null,{"$f":"IF(BI19=\"\",\"\",BG19+IF(BI19=\"XX\",VLOOKUP(\"WRONG\",Answers!AC:AD,2,FALSE),BI19)+BJ19)","v":""},{"$f":"Mainframe!R18","v":0},{"$f":"IF(BL19=0,\"\",IF(NOT(ISNA(VLOOKUP(BL19,Answers!AE:AF,2,FALSE))),VLOOKUP(BL19,Answers!AE:AF,2,FALSE),\"Help!\"))","v":""},null,{"$f":"IF(BM19=\"\",\"\",BK19+IF(BM19=\"XX\",VLOOKUP(\"WRONG\",Answers!AE:AF,2,FALSE),BM19)+BN19)","v":""},{"$f":"Mainframe!S18","v":0},{"$f":"IF(BP19=0,\"\",IF(NOT(ISNA(VLOOKUP(BP19,Answers!AG:AH,2,FALSE))),VLOOKUP(BP19,Answers!AG:AH,2,FALSE),\"Help!\"))","v":""},null,{"$f":"IF(BQ19=\"\",\"\",BO19+IF(BQ19=\"XX\",VLOOKUP(\"WRONG\",Answers!AG:AH,2,FALSE),BQ19)+BR19)","v":""},{"$f":"Mainframe!T18","v":0},{"$f":"IF(BT19=0,\"\",IF(NOT(ISNA(VLOOKUP(BT19,Answers!AI:AJ,2,FALSE))),VLOOKUP(BT19,Answers!AI:AJ,2,FALSE),\"Help!\"))","v":""},null,{"$f":"IF(BU19=\"\",\"\",BS19+IF(BU19=\"XX\",VLOOKUP(\"WRONG\",Answers!AI:AJ,2,FALSE),BU19)+BV19)","v":""},{"$f":"Mainframe!U18","v":0},{"$f":"IF(BX19=0,\"\",IF(NOT(ISNA(VLOOKUP(BX19,Answers!AK:AL,2,FALSE))),VLOOKUP(BX19,Answers!AK:AL,2,FALSE),\"Help!\"))","v":""},null,{"$f":"IF(BY19=\"\",\"\",BW19+IF(BY19=\"XX\",VLOOKUP(\"WRONG\",Answers!AK:AL,2,FALSE),BY19)+BZ19)","v":""},{"$f":"Mainframe!V18","v":0},{"$f":"IF(CB19=0,\"\",IF(NOT(ISNA(VLOOKUP(CB19,Answers!AM:AN,2,FALSE))),VLOOKUP(CB19,Answers!AM:AN,2,FALSE),\"Help!\"))","v":""},null,{"$f":"IF(CC19=\"\",\"\",CA19+IF(CC19=\"XX\",VLOOKUP(\"WRONG\",Answers!AM:AN,2,FALSE),CC19)+CD19)","v":""},null,null,"","","","",""]
["[*]",{"$f":"Mainframe!B19","v":0},18,{"$f":"Mainframe!C19","v":0},{"$f":"IF(D20=0,\"\",IF(NOT(ISNA(VLOOKUP(D20,Answers!A:B,2,FALSE))),VLOOKUP(D20,Answers!A:B,2,FALSE),\"Help!\"))","v":""},null,{"$f":"IF(E20=\"\",\"\",IF(E20=\"XX\",VLOOKUP(\"WRONG\",Answers!A:B,2,FALSE),E20)+F20)","v":""},{"$f":"Mainframe!D19","v":0},{"$f":"IF(H20=0,\"\",IF(NOT(ISNA(VLOOKUP(H20,Answers!C:D,2,FALSE))),VLOOKUP(H20,Answers!C:D,2,FALSE),\"Help!\"))","v":""},null,{"$f":"IF(I20=\"\",\"\",G20+IF(I20=\"XX\",VLOOKUP(\"WRONG\",Answers!C:D,2,FALSE),I20)+J20)","v":""},{"$f":"Mainframe!E19","v":0},{"$f":"IF(L20=0,\"\",IF(NOT(ISNA(VLOOKUP(L20,Answers!E:F,2,FALSE))),VLOOKUP(L20,Answers!E:F,2,FALSE),\"Help!\"))","v":""},null,{"$f":"IF(M20=\"\",\"\",K20+IF(M20=\"XX\",VLOOKUP(\"WRONG\",Answers!E:F,2,FALSE),M20)+N20)","v":""},{"$f":"Mainframe!F19","v":0},{"$f":"IF(P20=0,\"\",IF(NOT(ISNA(VLOOKUP(P20,Answers!G:H,2,FALSE))),VLOOKUP(P20,Answers!G:H,2,FALSE),\"Help!\"))","v":""},null,{"$f":"IF(Q20=\"\",\"\",O20+IF(Q20=\"XX\",VLOOKUP(\"WRONG\",Answers!G:H,2,FALSE),Q20)+R20)","v":""},{"$f":"Mainframe!G19","v":0},{"$f":"IF(T20=0,\"\",IF(NOT(ISNA(VLOOKUP(T20,Answers!I:J,2,FALSE))),VLOOKUP(T20,Answers!I:J,2,FALSE),\"Help!\"))","v":""},null,{"$f":"IF(U20=\"\",\"\",S20+IF(U20=\"XX\",VLOOKUP(\"WRONG\",Answers!I:J,2,FALSE),U20)+V20)","v":""},{"$f":"Mainframe!H19","v":0},{"$f":"IF(X20=0,\"\",IF(NOT(ISNA(VLOOKUP(X20,Answers!K:L,2,FALSE))),VLOOKUP(X20,Answers!K:L,2,FALSE),\"Help!\"))","v":""},null,{"$f":"IF(Y20=\"\",\"\",W20+IF(Y20=\"XX\",VLOOKUP(\"WRONG\",Answers!K:L,2,FALSE),Y20)+Z20)","v":""},{"$f":"Mainframe!I19","v":0},{"$f":"IF(AB20=0,\"\",IF(NOT(ISNA(VLOOKUP(AB20,Answers!M:N,2,FALSE))),VLOOKUP(AB20,Answers!M:N,2,FALSE),\"Help!\"))","v":""},null,{"$f":"IF(AC20=\"\",\"\",AA20+IF(AC20=\"XX\",VLOOKUP(\"WRONG\",Answers!M:N,2,FALSE),AC20)+AD20)","v":""},{"$f":"Mainframe!J19","v":0},{"$f":"IF(AF20=0,\"\",IF(NOT(ISNA(VLOOKUP(AF20,Answers!O:P,2,FALSE))),VLOOKUP(AF20,Answers!O:P,2,FALSE),\"Help!\"))","v":""},null,{"$f":"IF(AG20=\"\",\"\",AE20+IF(AG20=\"XX\",VLOOKUP(\"WRONG\",Answers!O:P,2,FALSE),AG20)+AH20)","v":""},{"$f":"Mainframe!K19","v":0},{"$f":"IF(AJ20=0,\"\",IF(NOT(ISNA(VLOOKUP(AJ20,Answers!Q:R,2,FALSE))),VLOOKUP(AJ20,Answers!Q:R,2,FALSE),\"Help!\"))","v":""},null,{"$f":"IF(AK20=\"\",\"\",AI20+IF(AK20=\"XX\",VLOOKUP(\"WRONG\",Answers!Q:R,2,FALSE),AK20)+AL20)","v":""},{"$f":"Mainframe!L19","v":0},{"$f":"IF(AN20=0,\"\",IF(NOT(ISNA(VLOOKUP(AN20,Answers!S:T,2,FALSE))),VLOOKUP(AN20,Answers!S:T,2,FALSE),\"Help!\"))","v":""},null,{"$f":"IF(AO20=\"\",\"\",AM20+IF(AO20=\"XX\",VLOOKUP(\"WRONG\",Answers!S:T,2,FALSE),AO20)+AP20)","v":""},{"$f":"Mainframe!M19","v":0},{"$f":"IF(AR20=0,\"\",IF(NOT(ISNA(VLOOKUP(AR20,Answers!U:V,2,FALSE))),VLOOKUP(AR20,Answers!U:V,2,FALSE),\"Help!\"))","v":""},null,{"$f":"IF(AS20=\"\",\"\",AQ20+IF(AS20=\"XX\",VLOOKUP(\"WRONG\",Answers!U:V,2,FALSE),AS20)+AT20)","v":""},{"$f":"Mainframe!N19","v":0},{"$f":"IF(AV20=0,\"\",IF(NOT(ISNA(VLOOKUP(AV20,Answers!W:X,2,FALSE))),VLOOKUP(AV20,Answers!W:X,2,FALSE),\"Help!\"))","v":""},null,{"$f":"IF(AW20=\"\",\"\",AU20+IF(AW20=\"XX\",VLOOKUP(\"WRONG\",Answers!W:X,2,FALSE),AW20)+AX20)","v":""},{"$f":"Mainframe!O19","v":0},{"$f":"IF(AZ20=0,\"\",IF(NOT(ISNA(VLOOKUP(AZ20,Answers!Y:Z,2,FALSE))),VLOOKUP(AZ20,Answers!Y:Z,2,FALSE),\"Help!\"))","v":""},null,{"$f":"IF(BA20=\"\",\"\",AY20+IF(BA20=\"XX\",VLOOKUP(\"WRONG\",Answers!Y:Z,2,FALSE),BA20)+BB20)","v":""},{"$f":"Mainframe!P19","v":0},{"$f":"IF(BD20=0,\"\",IF(NOT(ISNA(VLOOKUP(BD20,Answers!AA:AB,2,FALSE))),VLOOKUP(BD20,Answers!AA:AB,2,FALSE),\"Help!\"))","v":""},null,{"$f":"IF(BE20=\"\",\"\",BC20+IF(BE20=\"XX\",VLOOKUP(\"WRONG\",Answers!AA:AB,2,FALSE),BE20)+BF20)","v":""},{"$f":"Mainframe!Q19","v":0},{"$f":"IF(BH20=0,\"\",IF(NOT(ISNA(VLOOKUP(BH20,Answers!AC:AD,2,FALSE))),VLOOKUP(BH20,Answers!AC:AD,2,FALSE),\"Help!\"))","v":""},null,{"$f":"IF(BI20=\"\",\"\",BG20+IF(BI20=\"XX\",VLOOKUP(\"WRONG\",Answers!AC:AD,2,FALSE),BI20)+BJ20)","v":""},{"$f":"Mainframe!R19","v":0},{"$f":"IF(BL20=0,\"\",IF(NOT(ISNA(VLOOKUP(BL20,Answers!AE:AF,2,FALSE))),VLOOKUP(BL20,Answers!AE:AF,2,FALSE),\"Help!\"))","v":""},null,{"$f":"IF(BM20=\"\",\"\",BK20+IF(BM20=\"XX\",VLOOKUP(\"WRONG\",Answers!AE:AF,2,FALSE),BM20)+BN20)","v":""},{"$f":"Mainframe!S19","v":0},{"$f":"IF(BP20=0,\"\",IF(NOT(ISNA(VLOOKUP(BP20,Answers!AG:AH,2,FALSE))),VLOOKUP(BP20,Answers!AG:AH,2,FALSE),\"Help!\"))","v":""},null,{"$f":"IF(BQ20=\"\",\"\",BO20+IF(BQ20=\"XX\",VLOOKUP(\"WRONG\",Answers!AG:AH,2,FALSE),BQ20)+BR20)","v":""},{"$f":"Mainframe!T19","v":0},{"$f":"IF(BT20=0,\"\",IF(NOT(ISNA(VLOOKUP(BT20,Answers!AI:AJ,2,FALSE))),VLOOKUP(BT20,Answers!AI:AJ,2,FALSE),\"Help!\"))","v":""},null,{"$f":"IF(BU20=\"\",\"\",BS20+IF(BU20=\"XX\",VLOOKUP(\"WRONG\",Answers!AI:AJ,2,FALSE),BU20)+BV20)","v":""},{"$f":"Mainframe!U19","v":0},{"$f":"IF(BX20=0,\"\",IF(NOT(ISNA(VLOOKUP(BX20,Answers!AK:AL,2,FALSE))),VLOOKUP(BX20,Answers!AK:AL,2,FALSE),\"Help!\"))","v":""},null,{"$f":"IF(BY20=\"\",\"\",BW20+IF(BY20=\"XX\",VLOOKUP(\"WRONG\",Answers!AK:AL,2,FALSE),BY20)+BZ20)","v":""},{"$f":"Mainframe!V19","v":0},{"$f":"IF(CB20=0,\"\",IF(NOT(ISNA(VLOOKUP(CB20,Answers!AM:AN,2,FALSE))),VLOOKUP(CB20,Answers!AM:AN,2,FALSE),\"Help!\"))","v":""},null,{"$f":"IF(CC20=\"\",\"\",CA20+IF(CC20=\"XX\",VLOOKUP(\"WRONG\",Answers!AM:AN,2,FALSE),CC20)+CD20)","v":""},null,null,"","","","",""]
["[*]",{"$f":"Mainframe!B20","v":0},19,{"$f":"Mainframe!C20","v":0},{"$f":"IF(D21=0,\"\",IF(NOT(ISNA(VLOOKUP(D21,Answers!A:B,2,FALSE))),VLOOKUP(D21,Answers!A:B,2,FALSE),\"Help!\"))","v":""},null,{"$f":"IF(E21=\"\",\"\",IF(E21=\"XX\",VLOOKUP(\"WRONG\",Answers!A:B,2,FALSE),E21)+F21)","v":""},{"$f":"Mainframe!D20","v":0},{"$f":"IF(H21=0,\"\",IF(NOT(ISNA(VLOOKUP(H21,Answers!C:D,2,FALSE))),VLOOKUP(H21,Answers!C:D,2,FALSE),\"Help!\"))","v":""},null,{"$f":"IF(I21=\"\",\"\",G21+IF(I21=\"XX\",VLOOKUP(\"WRONG\",Answers!C:D,2,FALSE),I21)+J21)","v":""},{"$f":"Mainframe!E20","v":0},{"$f":"IF(L21=0,\"\",IF(NOT(ISNA(VLOOKUP(L21,Answers!E:F,2,FALSE))),VLOOKUP(L21,Answers!E:F,2,FALSE),\"Help!\"))","v":""},null,{"$f":"IF(M21=\"\",\"\",K21+IF(M21=\"XX\",VLOOKUP(\"WRONG\",Answers!E:F,2,FALSE),M21)+N21)","v":""},{"$f":"Mainframe!F20","v":0},{"$f":"IF(P21=0,\"\",IF(NOT(ISNA(VLOOKUP(P21,Answers!G:H,2,FALSE))),VLOOKUP(P21,Answers!G:H,2,FALSE),\"Help!\"))","v":""},null,{"$f":"IF(Q21=\"\",\"\",O21+IF(Q21=\"XX\",VLOOKUP(\"WRONG\",Answers!G:H,2,FALSE),Q21)+R21)","v":""},{"$f":"Mainframe!G20","v":0},{"$f":"IF(T21=0,\"\",IF(NOT(ISNA(VLOOKUP(T21,Answers!I:J,2,FALSE))),VLOOKUP(T21,Answers!I:J,2,FALSE),\"Help!\"))","v":""},null,{"$f":"IF(U21=\"\",\"\",S21+IF(U21=\"XX\",VLOOKUP(\"WRONG\",Answers!I:J,2,FALSE),U21)+V21)","v":""},{"$f":"Mainframe!H20","v":0},{"$f":"IF(X21=0,\"\",IF(NOT(ISNA(VLOOKUP(X21,Answers!K:L,2,FALSE))),VLOOKUP(X21,Answers!K:L,2,FALSE),\"Help!\"))","v":""},null,{"$f":"IF(Y21=\"\",\"\",W21+IF(Y21=\"XX\",VLOOKUP(\"WRONG\",Answers!K:L,2,FALSE),Y21)+Z21)","v":""},{"$f":"Mainframe!I20","v":0},{"$f":"IF(AB21=0,\"\",IF(NOT(ISNA(VLOOKUP(AB21,Answers!M:N,2,FALSE))),VLOOKUP(AB21,Answers!M:N,2,FALSE),\"Help!\"))","v":""},null,{"$f":"IF(AC21=\"\",\"\",AA21+IF(AC21=\"XX\",VLOOKUP(\"WRONG\",Answers!M:N,2,FALSE),AC21)+AD21)","v":""},{"$f":"Mainframe!J20","v":0},{"$f":"IF(AF21=0,\"\",IF(NOT(ISNA(VLOOKUP(AF21,Answers!O:P,2,FALSE))),VLOOKUP(AF21,Answers!O:P,2,FALSE),\"Help!\"))","v":""},null,{"$f":"IF(AG21=\"\",\"\",AE21+IF(AG21=\"XX\",VLOOKUP(\"WRONG\",Answers!O:P,2,FALSE),AG21)+AH21)","v":""},{"$f":"Mainframe!K20","v":0},{"$f":"IF(AJ21=0,\"\",IF(NOT(ISNA(VLOOKUP(AJ21,Answers!Q:R,2,FALSE))),VLOOKUP(AJ21,Answers!Q:R,2,FALSE),\"Help!\"))","v":""},null,{"$f":"IF(AK21=\"\",\"\",AI21+IF(AK21=\"XX\",VLOOKUP(\"WRONG\",Answers!Q:R,2,FALSE),AK21)+AL21)","v":""},{"$f":"Mainframe!L20","v":0},{"$f":"IF(AN21=0,\"\",IF(NOT(ISNA(VLOOKUP(AN21,Answers!S:T,2,FALSE))),VLOOKUP(AN21,Answers!S:T,2,FALSE),\"Help!\"))","v":""},null,{"$f":"IF(AO21=\"\",\"\",AM21+IF(AO21=\"XX\",VLOOKUP(\"WRONG\",Answers!S:T,2,FALSE),AO21)+AP21)","v":""},{"$f":"Mainframe!M20","v":0},{"$f":"IF(AR21=0,\"\",IF(NOT(ISNA(VLOOKUP(AR21,Answers!U:V,2,FALSE))),VLOOKUP(AR21,Answers!U:V,2,FALSE),\"Help!\"))","v":""},null,{"$f":"IF(AS21=\"\",\"\",AQ21+IF(AS21=\"XX\",VLOOKUP(\"WRONG\",Answers!U:V,2,FALSE),AS21)+AT21)","v":""},{"$f":"Mainframe!N20","v":0},{"$f":"IF(AV21=0,\"\",IF(NOT(ISNA(VLOOKUP(AV21,Answers!W:X,2,FALSE))),VLOOKUP(AV21,Answers!W:X,2,FALSE),\"Help!\"))","v":""},null,{"$f":"IF(AW21=\"\",\"\",AU21+IF(AW21=\"XX\",VLOOKUP(\"WRONG\",Answers!W:X,2,FALSE),AW21)+AX21)","v":""},{"$f":"Mainframe!O20","v":0},{"$f":"IF(AZ21=0,\"\",IF(NOT(ISNA(VLOOKUP(AZ21,Answers!Y:Z,2,FALSE))),VLOOKUP(AZ21,Answers!Y:Z,2,FALSE),\"Help!\"))","v":""},null,{"$f":"IF(BA21=\"\",\"\",AY21+IF(BA21=\"XX\",VLOOKUP(\"WRONG\",Answers!Y:Z,2,FALSE),BA21)+BB21)","v":""},{"$f":"Mainframe!P20","v":0},{"$f":"IF(BD21=0,\"\",IF(NOT(ISNA(VLOOKUP(BD21,Answers!AA:AB,2,FALSE))),VLOOKUP(BD21,Answers!AA:AB,2,FALSE),\"Help!\"))","v":""},null,{"$f":"IF(BE21=\"\",\"\",BC21+IF(BE21=\"XX\",VLOOKUP(\"WRONG\",Answers!AA:AB,2,FALSE),BE21)+BF21)","v":""},{"$f":"Mainframe!Q20","v":0},{"$f":"IF(BH21=0,\"\",IF(NOT(ISNA(VLOOKUP(BH21,Answers!AC:AD,2,FALSE))),VLOOKUP(BH21,Answers!AC:AD,2,FALSE),\"Help!\"))","v":""},null,{"$f":"IF(BI21=\"\",\"\",BG21+IF(BI21=\"XX\",VLOOKUP(\"WRONG\",Answers!AC:AD,2,FALSE),BI21)+BJ21)","v":""},{"$f":"Mainframe!R20","v":0},{"$f":"IF(BL21=0,\"\",IF(NOT(ISNA(VLOOKUP(BL21,Answers!AE:AF,2,FALSE))),VLOOKUP(BL21,Answers!AE:AF,2,FALSE),\"Help!\"))","v":""},null,{"$f":"IF(BM21=\"\",\"\",BK21+IF(BM21=\"XX\",VLOOKUP(\"WRONG\",Answers!AE:AF,2,FALSE),BM21)+BN21)","v":""},{"$f":"Mainframe!S20","v":0},{"$f":"IF(BP21=0,\"\",IF(NOT(ISNA(VLOOKUP(BP21,Answers!AG:AH,2,FALSE))),VLOOKUP(BP21,Answers!AG:AH,2,FALSE),\"Help!\"))","v":""},null,{"$f":"IF(BQ21=\"\",\"\",BO21+IF(BQ21=\"XX\",VLOOKUP(\"WRONG\",Answers!AG:AH,2,FALSE),BQ21)+BR21)","v":""},{"$f":"Mainframe!T20","v":0},{"$f":"IF(BT21=0,\"\",IF(NOT(ISNA(VLOOKUP(BT21,Answers!AI:AJ,2,FALSE))),VLOOKUP(BT21,Answers!AI:AJ,2,FALSE),\"Help!\"))","v":""},null,{"$f":"IF(BU21=\"\",\"\",BS21+IF(BU21=\"XX\",VLOOKUP(\"WRONG\",Answers!AI:AJ,2,FALSE),BU21)+BV21)","v":""},{"$f":"Mainframe!U20","v":0},{"$f":"IF(BX21=0,\"\",IF(NOT(ISNA(VLOOKUP(BX21,Answers!AK:AL,2,FALSE))),VLOOKUP(BX21,Answers!AK:AL,2,FALSE),\"Help!\"))","v":""},null,{"$f":"IF(BY21=\"\",\"\",BW21+IF(BY21=\"XX\",VLOOKUP(\"WRONG\",Answers!AK:AL,2,FALSE),BY21)+BZ21)","v":""},{"$f":"Mainframe!V20","v":0},{"$f":"IF(CB21=0,\"\",IF(NOT(ISNA(VLOOKUP(CB21,Answers!AM:AN,2,FALSE))),VLOOKUP(CB21,Answers!AM:AN,2,FALSE),\"Help!\"))","v":""},null,{"$f":"IF(CC21=\"\",\"\",CA21+IF(CC21=\"XX\",VLOOKUP(\"WRONG\",Answers!AM:AN,2,FALSE),CC21)+CD21)","v":""},null,null,"","","","",""]
["[*]",{"$f":"Mainframe!B21","v":0},20,{"$f":"Mainframe!C21","v":0},{"$f":"IF(D22=0,\"\",IF(NOT(ISNA(VLOOKUP(D22,Answers!A:B,2,FALSE))),VLOOKUP(D22,Answers!A:B,2,FALSE),\"Help!\"))","v":""},null,{"$f":"IF(E22=\"\",\"\",IF(E22=\"XX\",VLOOKUP(\"WRONG\",Answers!A:B,2,FALSE),E22)+F22)","v":""},{"$f":"Mainframe!D21","v":0},{"$f":"IF(H22=0,\"\",IF(NOT(ISNA(VLOOKUP(H22,Answers!C:D,2,FALSE))),VLOOKUP(H22,Answers!C:D,2,FALSE),\"Help!\"))","v":""},null,{"$f":"IF(I22=\"\",\"\",G22+IF(I22=\"XX\",VLOOKUP(\"WRONG\",Answers!C:D,2,FALSE),I22)+J22)","v":""},{"$f":"Mainframe!E21","v":0},{"$f":"IF(L22=0,\"\",IF(NOT(ISNA(VLOOKUP(L22,Answers!E:F,2,FALSE))),VLOOKUP(L22,Answers!E:F,2,FALSE),\"Help!\"))","v":""},null,{"$f":"IF(M22=\"\",\"\",K22+IF(M22=\"XX\",VLOOKUP(\"WRONG\",Answers!E:F,2,FALSE),M22)+N22)","v":""},{"$f":"Mainframe!F21","v":0},{"$f":"IF(P22=0,\"\",IF(NOT(ISNA(VLOOKUP(P22,Answers!G:H,2,FALSE))),VLOOKUP(P22,Answers!G:H,2,FALSE),\"Help!\"))","v":""},null,{"$f":"IF(Q22=\"\",\"\",O22+IF(Q22=\"XX\",VLOOKUP(\"WRONG\",Answers!G:H,2,FALSE),Q22)+R22)","v":""},{"$f":"Mainframe!G21","v":0},{"$f":"IF(T22=0,\"\",IF(NOT(ISNA(VLOOKUP(T22,Answers!I:J,2,FALSE))),VLOOKUP(T22,Answers!I:J,2,FALSE),\"Help!\"))","v":""},null,{"$f":"IF(U22=\"\",\"\",S22+IF(U22=\"XX\",VLOOKUP(\"WRONG\",Answers!I:J,2,FALSE),U22)+V22)","v":""},{"$f":"Mainframe!H21","v":0},{"$f":"IF(X22=0,\"\",IF(NOT(ISNA(VLOOKUP(X22,Answers!K:L,2,FALSE))),VLOOKUP(X22,Answers!K:L,2,FALSE),\"Help!\"))","v":""},null,{"$f":"IF(Y22=\"\",\"\",W22+IF(Y22=\"XX\",VLOOKUP(\"WRONG\",Answers!K:L,2,FALSE),Y22)+Z22)","v":""},{"$f":"Mainframe!I21","v":0},{"$f":"IF(AB22=0,\"\",IF(NOT(ISNA(VLOOKUP(AB22,Answers!M:N,2,FALSE))),VLOOKUP(AB22,Answers!M:N,2,FALSE),\"Help!\"))","v":""},null,{"$f":"IF(AC22=\"\",\"\",AA22+IF(AC22=\"XX\",VLOOKUP(\"WRONG\",Answers!M:N,2,FALSE),AC22)+AD22)","v":""},{"$f":"Mainframe!J21","v":0},{"$f":"IF(AF22=0,\"\",IF(NOT(ISNA(VLOOKUP(AF22,Answers!O:P,2,FALSE))),VLOOKUP(AF22,Answers!O:P,2,FALSE),\"Help!\"))","v":""},null,{"$f":"IF(AG22=\"\",\"\",AE22+IF(AG22=\"XX\",VLOOKUP(\"WRONG\",Answers!O:P,2,FALSE),AG22)+AH22)","v":""},{"$f":"Mainframe!K21","v":0},{"$f":"IF(AJ22=0,\"\",IF(NOT(ISNA(VLOOKUP(AJ22,Answers!Q:R,2,FALSE))),VLOOKUP(AJ22,Answers!Q:R,2,FALSE),\"Help!\"))","v":""},null,{"$f":"IF(AK22=\"\",\"\",AI22+IF(AK22=\"XX\",VLOOKUP(\"WRONG\",Answers!Q:R,2,FALSE),AK22)+AL22)","v":""},{"$f":"Mainframe!L21","v":0},{"$f":"IF(AN22=0,\"\",IF(NOT(ISNA(VLOOKUP(AN22,Answers!S:T,2,FALSE))),VLOOKUP(AN22,Answers!S:T,2,FALSE),\"Help!\"))","v":""},null,{"$f":"IF(AO22=\"\",\"\",AM22+IF(AO22=\"XX\",VLOOKUP(\"WRONG\",Answers!S:T,2,FALSE),AO22)+AP22)","v":""},{"$f":"Mainframe!M21","v":0},{"$f":"IF(AR22=0,\"\",IF(NOT(ISNA(VLOOKUP(AR22,Answers!U:V,2,FALSE))),VLOOKUP(AR22,Answers!U:V,2,FALSE),\"Help!\"))","v":""},null,{"$f":"IF(AS22=\"\",\"\",AQ22+IF(AS22=\"XX\",VLOOKUP(\"WRONG\",Answers!U:V,2,FALSE),AS22)+AT22)","v":""},{"$f":"Mainframe!N21","v":0},{"$f":"IF(AV22=0,\"\",IF(NOT(ISNA(VLOOKUP(AV22,Answers!W:X,2,FALSE))),VLOOKUP(AV22,Answers!W:X,2,FALSE),\"Help!\"))","v":""},null,{"$f":"IF(AW22=\"\",\"\",AU22+IF(AW22=\"XX\",VLOOKUP(\"WRONG\",Answers!W:X,2,FALSE),AW22)+AX22)","v":""},{"$f":"Mainframe!O21","v":0},{"$f":"IF(AZ22=0,\"\",IF(NOT(ISNA(VLOOKUP(AZ22,Answers!Y:Z,2,FALSE))),VLOOKUP(AZ22,Answers!Y:Z,2,FALSE),\"Help!\"))","v":""},null,{"$f":"IF(BA22=\"\",\"\",AY22+IF(BA22=\"XX\",VLOOKUP(\"WRONG\",Answers!Y:Z,2,FALSE),BA22)+BB22)","v":""},{"$f":"Mainframe!P21","v":0},{"$f":"IF(BD22=0,\"\",IF(NOT(ISNA(VLOOKUP(BD22,Answers!AA:AB,2,FALSE))),VLOOKUP(BD22,Answers!AA:AB,2,FALSE),\"Help!\"))","v":""},null,{"$f":"IF(BE22=\"\",\"\",BC22+IF(BE22=\"XX\",VLOOKUP(\"WRONG\",Answers!AA:AB,2,FALSE),BE22)+BF22)","v":""},{"$f":"Mainframe!Q21","v":0},{"$f":"IF(BH22=0,\"\",IF(NOT(ISNA(VLOOKUP(BH22,Answers!AC:AD,2,FALSE))),VLOOKUP(BH22,Answers!AC:AD,2,FALSE),\"Help!\"))","v":""},null,{"$f":"IF(BI22=\"\",\"\",BG22+IF(BI22=\"XX\",VLOOKUP(\"WRONG\",Answers!AC:AD,2,FALSE),BI22)+BJ22)","v":""},{"$f":"Mainframe!R21","v":0},{"$f":"IF(BL22=0,\"\",IF(NOT(ISNA(VLOOKUP(BL22,Answers!AE:AF,2,FALSE))),VLOOKUP(BL22,Answers!AE:AF,2,FALSE),\"Help!\"))","v":""},null,{"$f":"IF(BM22=\"\",\"\",BK22+IF(BM22=\"XX\",VLOOKUP(\"WRONG\",Answers!AE:AF,2,FALSE),BM22)+BN22)","v":""},{"$f":"Mainframe!S21","v":0},{"$f":"IF(BP22=0,\"\",IF(NOT(ISNA(VLOOKUP(BP22,Answers!AG:AH,2,FALSE))),VLOOKUP(BP22,Answers!AG:AH,2,FALSE),\"Help!\"))","v":""},null,{"$f":"IF(BQ22=\"\",\"\",BO22+IF(BQ22=\"XX\",VLOOKUP(\"WRONG\",Answers!AG:AH,2,FALSE),BQ22)+BR22)","v":""},{"$f":"Mainframe!T21","v":0},{"$f":"IF(BT22=0,\"\",IF(NOT(ISNA(VLOOKUP(BT22,Answers!AI:AJ,2,FALSE))),VLOOKUP(BT22,Answers!AI:AJ,2,FALSE),\"Help!\"))","v":""},null,{"$f":"IF(BU22=\"\",\"\",BS22+IF(BU22=\"XX\",VLOOKUP(\"WRONG\",Answers!AI:AJ,2,FALSE),BU22)+BV22)","v":""},{"$f":"Mainframe!U21","v":0},{"$f":"IF(BX22=0,\"\",IF(NOT(ISNA(VLOOKUP(BX22,Answers!AK:AL,2,FALSE))),VLOOKUP(BX22,Answers!AK:AL,2,FALSE),\"Help!\"))","v":""},null,{"$f":"IF(BY22=\"\",\"\",BW22+IF(BY22=\"XX\",VLOOKUP(\"WRONG\",Answers!AK:AL,2,FALSE),BY22)+BZ22)","v":""},{"$f":"Mainframe!V21","v":0},{"$f":"IF(CB22=0,\"\",IF(NOT(ISNA(VLOOKUP(CB22,Answers!AM:AN,2,FALSE))),VLOOKUP(CB22,Answers!AM:AN,2,FALSE),\"Help!\"))","v":""},null,{"$f":"IF(CC22=\"\",\"\",CA22+IF(CC22=\"XX\",VLOOKUP(\"WRONG\",Answers!AM:AN,2,FALSE),CC22)+CD22)","v":""},null,null,"","","","",""]
["[*]",{"$f":"Mainframe!B22","v":0},21,{"$f":"Mainframe!C22","v":0},{"$f":"IF(D23=0,\"\",IF(NOT(ISNA(VLOOKUP(D23,Answers!A:B,2,FALSE))),VLOOKUP(D23,Answers!A:B,2,FALSE),\"Help!\"))","v":""},null,{"$f":"IF(E23=\"\",\"\",IF(E23=\"XX\",VLOOKUP(\"WRONG\",Answers!A:B,2,FALSE),E23)+F23)","v":""},{"$f":"Mainframe!D22","v":0},{"$f":"IF(H23=0,\"\",IF(NOT(ISNA(VLOOKUP(H23,Answers!C:D,2,FALSE))),VLOOKUP(H23,Answers!C:D,2,FALSE),\"Help!\"))","v":""},null,{"$f":"IF(I23=\"\",\"\",G23+IF(I23=\"XX\",VLOOKUP(\"WRONG\",Answers!C:D,2,FALSE),I23)+J23)","v":""},{"$f":"Mainframe!E22","v":0},{"$f":"IF(L23=0,\"\",IF(NOT(ISNA(VLOOKUP(L23,Answers!E:F,2,FALSE))),VLOOKUP(L23,Answers!E:F,2,FALSE),\"Help!\"))","v":""},null,{"$f":"IF(M23=\"\",\"\",K23+IF(M23=\"XX\",VLOOKUP(\"WRONG\",Answers!E:F,2,FALSE),M23)+N23)","v":""},{"$f":"Mainframe!F22","v":0},{"$f":"IF(P23=0,\"\",IF(NOT(ISNA(VLOOKUP(P23,Answers!G:H,2,FALSE))),VLOOKUP(P23,Answers!G:H,2,FALSE),\"Help!\"))","v":""},null,{"$f":"IF(Q23=\"\",\"\",O23+IF(Q23=\"XX\",VLOOKUP(\"WRONG\",Answers!G:H,2,FALSE),Q23)+R23)","v":""},{"$f":"Mainframe!G22","v":0},{"$f":"IF(T23=0,\"\",IF(NOT(ISNA(VLOOKUP(T23,Answers!I:J,2,FALSE))),VLOOKUP(T23,Answers!I:J,2,FALSE),\"Help!\"))","v":""},null,{"$f":"IF(U23=\"\",\"\",S23+IF(U23=\"XX\",VLOOKUP(\"WRONG\",Answers!I:J,2,FALSE),U23)+V23)","v":""},{"$f":"Mainframe!H22","v":0},{"$f":"IF(X23=0,\"\",IF(NOT(ISNA(VLOOKUP(X23,Answers!K:L,2,FALSE))),VLOOKUP(X23,Answers!K:L,2,FALSE),\"Help!\"))","v":""},null,{"$f":"IF(Y23=\"\",\"\",W23+IF(Y23=\"XX\",VLOOKUP(\"WRONG\",Answers!K:L,2,FALSE),Y23)+Z23)","v":""},{"$f":"Mainframe!I22","v":0},{"$f":"IF(AB23=0,\"\",IF(NOT(ISNA(VLOOKUP(AB23,Answers!M:N,2,FALSE))),VLOOKUP(AB23,Answers!M:N,2,FALSE),\"Help!\"))","v":""},null,{"$f":"IF(AC23=\"\",\"\",AA23+IF(AC23=\"XX\",VLOOKUP(\"WRONG\",Answers!M:N,2,FALSE),AC23)+AD23)","v":""},{"$f":"Mainframe!J22","v":0},{"$f":"IF(AF23=0,\"\",IF(NOT(ISNA(VLOOKUP(AF23,Answers!O:P,2,FALSE))),VLOOKUP(AF23,Answers!O:P,2,FALSE),\"Help!\"))","v":""},null,{"$f":"IF(AG23=\"\",\"\",AE23+IF(AG23=\"XX\",VLOOKUP(\"WRONG\",Answers!O:P,2,FALSE),AG23)+AH23)","v":""},{"$f":"Mainframe!K22","v":0},{"$f":"IF(AJ23=0,\"\",IF(NOT(ISNA(VLOOKUP(AJ23,Answers!Q:R,2,FALSE))),VLOOKUP(AJ23,Answers!Q:R,2,FALSE),\"Help!\"))","v":""},null,{"$f":"IF(AK23=\"\",\"\",AI23+IF(AK23=\"XX\",VLOOKUP(\"WRONG\",Answers!Q:R,2,FALSE),AK23)+AL23)","v":""},{"$f":"Mainframe!L22","v":0},{"$f":"IF(AN23=0,\"\",IF(NOT(ISNA(VLOOKUP(AN23,Answers!S:T,2,FALSE))),VLOOKUP(AN23,Answers!S:T,2,FALSE),\"Help!\"))","v":""},null,{"$f":"IF(AO23=\"\",\"\",AM23+IF(AO23=\"XX\",VLOOKUP(\"WRONG\",Answers!S:T,2,FALSE),AO23)+AP23)","v":""},{"$f":"Mainframe!M22","v":0},{"$f":"IF(AR23=0,\"\",IF(NOT(ISNA(VLOOKUP(AR23,Answers!U:V,2,FALSE))),VLOOKUP(AR23,Answers!U:V,2,FALSE),\"Help!\"))","v":""},null,{"$f":"IF(AS23=\"\",\"\",AQ23+IF(AS23=\"XX\",VLOOKUP(\"WRONG\",Answers!U:V,2,FALSE),AS23)+AT23)","v":""},{"$f":"Mainframe!N22","v":0},{"$f":"IF(AV23=0,\"\",IF(NOT(ISNA(VLOOKUP(AV23,Answers!W:X,2,FALSE))),VLOOKUP(AV23,Answers!W:X,2,FALSE),\"Help!\"))","v":""},null,{"$f":"IF(AW23=\"\",\"\",AU23+IF(AW23=\"XX\",VLOOKUP(\"WRONG\",Answers!W:X,2,FALSE),AW23)+AX23)","v":""},{"$f":"Mainframe!O22","v":0},{"$f":"IF(AZ23=0,\"\",IF(NOT(ISNA(VLOOKUP(AZ23,Answers!Y:Z,2,FALSE))),VLOOKUP(AZ23,Answers!Y:Z,2,FALSE),\"Help!\"))","v":""},null,{"$f":"IF(BA23=\"\",\"\",AY23+IF(BA23=\"XX\",VLOOKUP(\"WRONG\",Answers!Y:Z,2,FALSE),BA23)+BB23)","v":""},{"$f":"Mainframe!P22","v":0},{"$f":"IF(BD23=0,\"\",IF(NOT(ISNA(VLOOKUP(BD23,Answers!AA:AB,2,FALSE))),VLOOKUP(BD23,Answers!AA:AB,2,FALSE),\"Help!\"))","v":""},null,{"$f":"IF(BE23=\"\",\"\",BC23+IF(BE23=\"XX\",VLOOKUP(\"WRONG\",Answers!AA:AB,2,FALSE),BE23)+BF23)","v":""},{"$f":"Mainframe!Q22","v":0},{"$f":"IF(BH23=0,\"\",IF(NOT(ISNA(VLOOKUP(BH23,Answers!AC:AD,2,FALSE))),VLOOKUP(BH23,Answers!AC:AD,2,FALSE),\"Help!\"))","v":""},null,{"$f":"IF(BI23=\"\",\"\",BG23+IF(BI23=\"XX\",VLOOKUP(\"WRONG\",Answers!AC:AD,2,FALSE),BI23)+BJ23)","v":""},{"$f":"Mainframe!R22","v":0},{"$f":"IF(BL23=0,\"\",IF(NOT(ISNA(VLOOKUP(BL23,Answers!AE:AF,2,FALSE))),VLOOKUP(BL23,Answers!AE:AF,2,FALSE),\"Help!\"))","v":""},null,{"$f":"IF(BM23=\"\",\"\",BK23+IF(BM23=\"XX\",VLOOKUP(\"WRONG\",Answers!AE:AF,2,FALSE),BM23)+BN23)","v":""},{"$f":"Mainframe!S22","v":0},{"$f":"IF(BP23=0,\"\",IF(NOT(ISNA(VLOOKUP(BP23,Answers!AG:AH,2,FALSE))),VLOOKUP(BP23,Answers!AG:AH,2,FALSE),\"Help!\"))","v":""},null,{"$f":"IF(BQ23=\"\",\"\",BO23+IF(BQ23=\"XX\",VLOOKUP(\"WRONG\",Answers!AG:AH,2,FALSE),BQ23)+BR23)","v":""},{"$f":"Mainframe!T22","v":0},{"$f":"IF(BT23=0,\"\",IF(NOT(ISNA(VLOOKUP(BT23,Answers!AI:AJ,2,FALSE))),VLOOKUP(BT23,Answers!AI:AJ,2,FALSE),\"Help!\"))","v":""},null,{"$f":"IF(BU23=\"\",\"\",BS23+IF(BU23=\"XX\",VLOOKUP(\"WRONG\",Answers!AI:AJ,2,FALSE),BU23)+BV23)","v":""},{"$f":"Mainframe!U22","v":0},{"$f":"IF(BX23=0,\"\",IF(NOT(ISNA(VLOOKUP(BX23,Answers!AK:AL,2,FALSE))),VLOOKUP(BX23,Answers!AK:AL,2,FALSE),\"Help!\"))","v":""},null,{"$f":"IF(BY23=\"\",\"\",BW23+IF(BY23=\"XX\",VLOOKUP(\"WRONG\",Answers!AK:AL,2,FALSE),BY23)+BZ23)","v":""},{"$f":"Mainframe!V22","v":0},{"$f":"IF(CB23=0,\"\",IF(NOT(ISNA(VLOOKUP(CB23,Answers!AM:AN,2,FALSE))),VLOOKUP(CB23,Answers!AM:AN,2,FALSE),\"Help!\"))","v":""},null,{"$f":"IF(CC23=\"\",\"\",CA23+IF(CC23=\"XX\",VLOOKUP(\"WRONG\",Answers!AM:AN,2,FALSE),CC23)+CD23)","v":""},null,null,"","","","",""]
["[*]",{"$f":"Mainframe!B23","v":0},22,{"$f":"Mainframe!C23","v":0},{"$f":"IF(D24=0,\"\",IF(NOT(ISNA(VLOOKUP(D24,Answers!A:B,2,FALSE))),VLOOKUP(D24,Answers!A:B,2,FALSE),\"Help!\"))","v":""},null,{"$f":"IF(E24=\"\",\"\",IF(E24=\"XX\",VLOOKUP(\"WRONG\",Answers!A:B,2,FALSE),E24)+F24)","v":""},{"$f":"Mainframe!D23","v":0},{"$f":"IF(H24=0,\"\",IF(NOT(ISNA(VLOOKUP(H24,Answers!C:D,2,FALSE))),VLOOKUP(H24,Answers!C:D,2,FALSE),\"Help!\"))","v":""},null,{"$f":"IF(I24=\"\",\"\",G24+IF(I24=\"XX\",VLOOKUP(\"WRONG\",Answers!C:D,2,FALSE),I24)+J24)","v":""},{"$f":"Mainframe!E23","v":0},{"$f":"IF(L24=0,\"\",IF(NOT(ISNA(VLOOKUP(L24,Answers!E:F,2,FALSE))),VLOOKUP(L24,Answers!E:F,2,FALSE),\"Help!\"))","v":""},null,{"$f":"IF(M24=\"\",\"\",K24+IF(M24=\"XX\",VLOOKUP(\"WRONG\",Answers!E:F,2,FALSE),M24)+N24)","v":""},{"$f":"Mainframe!F23","v":0},{"$f":"IF(P24=0,\"\",IF(NOT(ISNA(VLOOKUP(P24,Answers!G:H,2,FALSE))),VLOOKUP(P24,Answers!G:H,2,FALSE),\"Help!\"))","v":""},null,{"$f":"IF(Q24=\"\",\"\",O24+IF(Q24=\"XX\",VLOOKUP(\"WRONG\",Answers!G:H,2,FALSE),Q24)+R24)","v":""},{"$f":"Mainframe!G23","v":0},{"$f":"IF(T24=0,\"\",IF(NOT(ISNA(VLOOKUP(T24,Answers!I:J,2,FALSE))),VLOOKUP(T24,Answers!I:J,2,FALSE),\"Help!\"))","v":""},null,{"$f":"IF(U24=\"\",\"\",S24+IF(U24=\"XX\",VLOOKUP(\"WRONG\",Answers!I:J,2,FALSE),U24)+V24)","v":""},{"$f":"Mainframe!H23","v":0},{"$f":"IF(X24=0,\"\",IF(NOT(ISNA(VLOOKUP(X24,Answers!K:L,2,FALSE))),VLOOKUP(X24,Answers!K:L,2,FALSE),\"Help!\"))","v":""},null,{"$f":"IF(Y24=\"\",\"\",W24+IF(Y24=\"XX\",VLOOKUP(\"WRONG\",Answers!K:L,2,FALSE),Y24)+Z24)","v":""},{"$f":"Mainframe!I23","v":0},{"$f":"IF(AB24=0,\"\",IF(NOT(ISNA(VLOOKUP(AB24,Answers!M:N,2,FALSE))),VLOOKUP(AB24,Answers!M:N,2,FALSE),\"Help!\"))","v":""},null,{"$f":"IF(AC24=\"\",\"\",AA24+IF(AC24=\"XX\",VLOOKUP(\"WRONG\",Answers!M:N,2,FALSE),AC24)+AD24)","v":""},{"$f":"Mainframe!J23","v":0},{"$f":"IF(AF24=0,\"\",IF(NOT(ISNA(VLOOKUP(AF24,Answers!O:P,2,FALSE))),VLOOKUP(AF24,Answers!O:P,2,FALSE),\"Help!\"))","v":""},null,{"$f":"IF(AG24=\"\",\"\",AE24+IF(AG24=\"XX\",VLOOKUP(\"WRONG\",Answers!O:P,2,FALSE),AG24)+AH24)","v":""},{"$f":"Mainframe!K23","v":0},{"$f":"IF(AJ24=0,\"\",IF(NOT(ISNA(VLOOKUP(AJ24,Answers!Q:R,2,FALSE))),VLOOKUP(AJ24,Answers!Q:R,2,FALSE),\"Help!\"))","v":""},null,{"$f":"IF(AK24=\"\",\"\",AI24+IF(AK24=\"XX\",VLOOKUP(\"WRONG\",Answers!Q:R,2,FALSE),AK24)+AL24)","v":""},{"$f":"Mainframe!L23","v":0},{"$f":"IF(AN24=0,\"\",IF(NOT(ISNA(VLOOKUP(AN24,Answers!S:T,2,FALSE))),VLOOKUP(AN24,Answers!S:T,2,FALSE),\"Help!\"))","v":""},null,{"$f":"IF(AO24=\"\",\"\",AM24+IF(AO24=\"XX\",VLOOKUP(\"WRONG\",Answers!S:T,2,FALSE),AO24)+AP24)","v":""},{"$f":"Mainframe!M23","v":0},{"$f":"IF(AR24=0,\"\",IF(NOT(ISNA(VLOOKUP(AR24,Answers!U:V,2,FALSE))),VLOOKUP(AR24,Answers!U:V,2,FALSE),\"Help!\"))","v":""},null,{"$f":"IF(AS24=\"\",\"\",AQ24+IF(AS24=\"XX\",VLOOKUP(\"WRONG\",Answers!U:V,2,FALSE),AS24)+AT24)","v":""},{"$f":"Mainframe!N23","v":0},{"$f":"IF(AV24=0,\"\",IF(NOT(ISNA(VLOOKUP(AV24,Answers!W:X,2,FALSE))),VLOOKUP(AV24,Answers!W:X,2,FALSE),\"Help!\"))","v":""},null,{"$f":"IF(AW24=\"\",\"\",AU24+IF(AW24=\"XX\",VLOOKUP(\"WRONG\",Answers!W:X,2,FALSE),AW24)+AX24)","v":""},{"$f":"Mainframe!O23","v":0},{"$f":"IF(AZ24=0,\"\",IF(NOT(ISNA(VLOOKUP(AZ24,Answers!Y:Z,2,FALSE))),VLOOKUP(AZ24,Answers!Y:Z,2,FALSE),\"Help!\"))","v":""},null,{"$f":"IF(BA24=\"\",\"\",AY24+IF(BA24=\"XX\",VLOOKUP(\"WRONG\",Answers!Y:Z,2,FALSE),BA24)+BB24)","v":""},{"$f":"Mainframe!P23","v":0},{"$f":"IF(BD24=0,\"\",IF(NOT(ISNA(VLOOKUP(BD24,Answers!AA:AB,2,FALSE))),VLOOKUP(BD24,Answers!AA:AB,2,FALSE),\"Help!\"))","v":""},null,{"$f":"IF(BE24=\"\",\"\",BC24+IF(BE24=\"XX\",VLOOKUP(\"WRONG\",Answers!AA:AB,2,FALSE),BE24)+BF24)","v":""},{"$f":"Mainframe!Q23","v":0},{"$f":"IF(BH24=0,\"\",IF(NOT(ISNA(VLOOKUP(BH24,Answers!AC:AD,2,FALSE))),VLOOKUP(BH24,Answers!AC:AD,2,FALSE),\"Help!\"))","v":""},null,{"$f":"IF(BI24=\"\",\"\",BG24+IF(BI24=\"XX\",VLOOKUP(\"WRONG\",Answers!AC:AD,2,FALSE),BI24)+BJ24)","v":""},{"$f":"Mainframe!R23","v":0},{"$f":"IF(BL24=0,\"\",IF(NOT(ISNA(VLOOKUP(BL24,Answers!AE:AF,2,FALSE))),VLOOKUP(BL24,Answers!AE:AF,2,FALSE),\"Help!\"))","v":""},null,{"$f":"IF(BM24=\"\",\"\",BK24+IF(BM24=\"XX\",VLOOKUP(\"WRONG\",Answers!AE:AF,2,FALSE),BM24)+BN24)","v":""},{"$f":"Mainframe!S23","v":0},{"$f":"IF(BP24=0,\"\",IF(NOT(ISNA(VLOOKUP(BP24,Answers!AG:AH,2,FALSE))),VLOOKUP(BP24,Answers!AG:AH,2,FALSE),\"Help!\"))","v":""},null,{"$f":"IF(BQ24=\"\",\"\",BO24+IF(BQ24=\"XX\",VLOOKUP(\"WRONG\",Answers!AG:AH,2,FALSE),BQ24)+BR24)","v":""},{"$f":"Mainframe!T23","v":0},{"$f":"IF(BT24=0,\"\",IF(NOT(ISNA(VLOOKUP(BT24,Answers!AI:AJ,2,FALSE))),VLOOKUP(BT24,Answers!AI:AJ,2,FALSE),\"Help!\"))","v":""},null,{"$f":"IF(BU24=\"\",\"\",BS24+IF(BU24=\"XX\",VLOOKUP(\"WRONG\",Answers!AI:AJ,2,FALSE),BU24)+BV24)","v":""},{"$f":"Mainframe!U23","v":0},{"$f":"IF(BX24=0,\"\",IF(NOT(ISNA(VLOOKUP(BX24,Answers!AK:AL,2,FALSE))),VLOOKUP(BX24,Answers!AK:AL,2,FALSE),\"Help!\"))","v":""},null,{"$f":"IF(BY24=\"\",\"\",BW24+IF(BY24=\"XX\",VLOOKUP(\"WRONG\",Answers!AK:AL,2,FALSE),BY24)+BZ24)","v":""},{"$f":"Mainframe!V23","v":0},{"$f":"IF(CB24=0,\"\",IF(NOT(ISNA(VLOOKUP(CB24,Answers!AM:AN,2,FALSE))),VLOOKUP(CB24,Answers!AM:AN,2,FALSE),\"Help!\"))","v":""},null,{"$f":"IF(CC24=\"\",\"\",CA24+IF(CC24=\"XX\",VLOOKUP(\"WRONG\",Answers!AM:AN,2,FALSE),CC24)+CD24)","v":""},null,null,"","","","",""]
["[*]",{"$f":"Mainframe!B24","v":0},23,{"$f":"Mainframe!C24","v":0},{"$f":"IF(D25=0,\"\",IF(NOT(ISNA(VLOOKUP(D25,Answers!A:B,2,FALSE))),VLOOKUP(D25,Answers!A:B,2,FALSE),\"Help!\"))","v":""},null,{"$f":"IF(E25=\"\",\"\",IF(E25=\"XX\",VLOOKUP(\"WRONG\",Answers!A:B,2,FALSE),E25)+F25)","v":""},{"$f":"Mainframe!D24","v":0},{"$f":"IF(H25=0,\"\",IF(NOT(ISNA(VLOOKUP(H25,Answers!C:D,2,FALSE))),VLOOKUP(H25,Answers!C:D,2,FALSE),\"Help!\"))","v":""},null,{"$f":"IF(I25=\"\",\"\",G25+IF(I25=\"XX\",VLOOKUP(\"WRONG\",Answers!C:D,2,FALSE),I25)+J25)","v":""},{"$f":"Mainframe!E24","v":0},{"$f":"IF(L25=0,\"\",IF(NOT(ISNA(VLOOKUP(L25,Answers!E:F,2,FALSE))),VLOOKUP(L25,Answers!E:F,2,FALSE),\"Help!\"))","v":""},null,{"$f":"IF(M25=\"\",\"\",K25+IF(M25=\"XX\",VLOOKUP(\"WRONG\",Answers!E:F,2,FALSE),M25)+N25)","v":""},{"$f":"Mainframe!F24","v":0},{"$f":"IF(P25=0,\"\",IF(NOT(ISNA(VLOOKUP(P25,Answers!G:H,2,FALSE))),VLOOKUP(P25,Answers!G:H,2,FALSE),\"Help!\"))","v":""},null,{"$f":"IF(Q25=\"\",\"\",O25+IF(Q25=\"XX\",VLOOKUP(\"WRONG\",Answers!G:H,2,FALSE),Q25)+R25)","v":""},{"$f":"Mainframe!G24","v":0},{"$f":"IF(T25=0,\"\",IF(NOT(ISNA(VLOOKUP(T25,Answers!I:J,2,FALSE))),VLOOKUP(T25,Answers!I:J,2,FALSE),\"Help!\"))","v":""},null,{"$f":"IF(U25=\"\",\"\",S25+IF(U25=\"XX\",VLOOKUP(\"WRONG\",Answers!I:J,2,FALSE),U25)+V25)","v":""},{"$f":"Mainframe!H24","v":0},{"$f":"IF(X25=0,\"\",IF(NOT(ISNA(VLOOKUP(X25,Answers!K:L,2,FALSE))),VLOOKUP(X25,Answers!K:L,2,FALSE),\"Help!\"))","v":""},null,{"$f":"IF(Y25=\"\",\"\",W25+IF(Y25=\"XX\",VLOOKUP(\"WRONG\",Answers!K:L,2,FALSE),Y25)+Z25)","v":""},{"$f":"Mainframe!I24","v":0},{"$f":"IF(AB25=0,\"\",IF(NOT(ISNA(VLOOKUP(AB25,Answers!M:N,2,FALSE))),VLOOKUP(AB25,Answers!M:N,2,FALSE),\"Help!\"))","v":""},null,{"$f":"IF(AC25=\"\",\"\",AA25+IF(AC25=\"XX\",VLOOKUP(\"WRONG\",Answers!M:N,2,FALSE),AC25)+AD25)","v":""},{"$f":"Mainframe!J24","v":0},{"$f":"IF(AF25=0,\"\",IF(NOT(ISNA(VLOOKUP(AF25,Answers!O:P,2,FALSE))),VLOOKUP(AF25,Answers!O:P,2,FALSE),\"Help!\"))","v":""},null,{"$f":"IF(AG25=\"\",\"\",AE25+IF(AG25=\"XX\",VLOOKUP(\"WRONG\",Answers!O:P,2,FALSE),AG25)+AH25)","v":""},{"$f":"Mainframe!K24","v":0},{"$f":"IF(AJ25=0,\"\",IF(NOT(ISNA(VLOOKUP(AJ25,Answers!Q:R,2,FALSE))),VLOOKUP(AJ25,Answers!Q:R,2,FALSE),\"Help!\"))","v":""},null,{"$f":"IF(AK25=\"\",\"\",AI25+IF(AK25=\"XX\",VLOOKUP(\"WRONG\",Answers!Q:R,2,FALSE),AK25)+AL25)","v":""},{"$f":"Mainframe!L24","v":0},{"$f":"IF(AN25=0,\"\",IF(NOT(ISNA(VLOOKUP(AN25,Answers!S:T,2,FALSE))),VLOOKUP(AN25,Answers!S:T,2,FALSE),\"Help!\"))","v":""},null,{"$f":"IF(AO25=\"\",\"\",AM25+IF(AO25=\"XX\",VLOOKUP(\"WRONG\",Answers!S:T,2,FALSE),AO25)+AP25)","v":""},{"$f":"Mainframe!M24","v":0},{"$f":"IF(AR25=0,\"\",IF(NOT(ISNA(VLOOKUP(AR25,Answers!U:V,2,FALSE))),VLOOKUP(AR25,Answers!U:V,2,FALSE),\"Help!\"))","v":""},null,{"$f":"IF(AS25=\"\",\"\",AQ25+IF(AS25=\"XX\",VLOOKUP(\"WRONG\",Answers!U:V,2,FALSE),AS25)+AT25)","v":""},{"$f":"Mainframe!N24","v":0},{"$f":"IF(AV25=0,\"\",IF(NOT(ISNA(VLOOKUP(AV25,Answers!W:X,2,FALSE))),VLOOKUP(AV25,Answers!W:X,2,FALSE),\"Help!\"))","v":""},null,{"$f":"IF(AW25=\"\",\"\",AU25+IF(AW25=\"XX\",VLOOKUP(\"WRONG\",Answers!W:X,2,FALSE),AW25)+AX25)","v":""},{"$f":"Mainframe!O24","v":0},{"$f":"IF(AZ25=0,\"\",IF(NOT(ISNA(VLOOKUP(AZ25,Answers!Y:Z,2,FALSE))),VLOOKUP(AZ25,Answers!Y:Z,2,FALSE),\"Help!\"))","v":""},null,{"$f":"IF(BA25=\"\",\"\",AY25+IF(BA25=\"XX\",VLOOKUP(\"WRONG\",Answers!Y:Z,2,FALSE),BA25)+BB25)","v":""},{"$f":"Mainframe!P24","v":0},{"$f":"IF(BD25=0,\"\",IF(NOT(ISNA(VLOOKUP(BD25,Answers!AA:AB,2,FALSE))),VLOOKUP(BD25,Answers!AA:AB,2,FALSE),\"Help!\"))","v":""},null,{"$f":"IF(BE25=\"\",\"\",BC25+IF(BE25=\"XX\",VLOOKUP(\"WRONG\",Answers!AA:AB,2,FALSE),BE25)+BF25)","v":""},{"$f":"Mainframe!Q24","v":0},{"$f":"IF(BH25=0,\"\",IF(NOT(ISNA(VLOOKUP(BH25,Answers!AC:AD,2,FALSE))),VLOOKUP(BH25,Answers!AC:AD,2,FALSE),\"Help!\"))","v":""},null,{"$f":"IF(BI25=\"\",\"\",BG25+IF(BI25=\"XX\",VLOOKUP(\"WRONG\",Answers!AC:AD,2,FALSE),BI25)+BJ25)","v":""},{"$f":"Mainframe!R24","v":0},{"$f":"IF(BL25=0,\"\",IF(NOT(ISNA(VLOOKUP(BL25,Answers!AE:AF,2,FALSE))),VLOOKUP(BL25,Answers!AE:AF,2,FALSE),\"Help!\"))","v":""},null,{"$f":"IF(BM25=\"\",\"\",BK25+IF(BM25=\"XX\",VLOOKUP(\"WRONG\",Answers!AE:AF,2,FALSE),BM25)+BN25)","v":""},{"$f":"Mainframe!S24","v":0},{"$f":"IF(BP25=0,\"\",IF(NOT(ISNA(VLOOKUP(BP25,Answers!AG:AH,2,FALSE))),VLOOKUP(BP25,Answers!AG:AH,2,FALSE),\"Help!\"))","v":""},null,{"$f":"IF(BQ25=\"\",\"\",BO25+IF(BQ25=\"XX\",VLOOKUP(\"WRONG\",Answers!AG:AH,2,FALSE),BQ25)+BR25)","v":""},{"$f":"Mainframe!T24","v":0},{"$f":"IF(BT25=0,\"\",IF(NOT(ISNA(VLOOKUP(BT25,Answers!AI:AJ,2,FALSE))),VLOOKUP(BT25,Answers!AI:AJ,2,FALSE),\"Help!\"))","v":""},null,{"$f":"IF(BU25=\"\",\"\",BS25+IF(BU25=\"XX\",VLOOKUP(\"WRONG\",Answers!AI:AJ,2,FALSE),BU25)+BV25)","v":""},{"$f":"Mainframe!U24","v":0},{"$f":"IF(BX25=0,\"\",IF(NOT(ISNA(VLOOKUP(BX25,Answers!AK:AL,2,FALSE))),VLOOKUP(BX25,Answers!AK:AL,2,FALSE),\"Help!\"))","v":""},null,{"$f":"IF(BY25=\"\",\"\",BW25+IF(BY25=\"XX\",VLOOKUP(\"WRONG\",Answers!AK:AL,2,FALSE),BY25)+BZ25)","v":""},{"$f":"Mainframe!V24","v":0},{"$f":"IF(CB25=0,\"\",IF(NOT(ISNA(VLOOKUP(CB25,Answers!AM:AN,2,FALSE))),VLOOKUP(CB25,Answers!AM:AN,2,FALSE),\"Help!\"))","v":""},null,{"$f":"IF(CC25=\"\",\"\",CA25+IF(CC25=\"XX\",VLOOKUP(\"WRONG\",Answers!AM:AN,2,FALSE),CC25)+CD25)","v":""},null,null,"","","","",""]
["[*]",{"$f":"Mainframe!B25","v":0},24,{"$f":"Mainframe!C25","v":0},{"$f":"IF(D26=0,\"\",IF(NOT(ISNA(VLOOKUP(D26,Answers!A:B,2,FALSE))),VLOOKUP(D26,Answers!A:B,2,FALSE),\"Help!\"))","v":""},null,{"$f":"IF(E26=\"\",\"\",IF(E26=\"XX\",VLOOKUP(\"WRONG\",Answers!A:B,2,FALSE),E26)+F26)","v":""},{"$f":"Mainframe!D25","v":0},{"$f":"IF(H26=0,\"\",IF(NOT(ISNA(VLOOKUP(H26,Answers!C:D,2,FALSE))),VLOOKUP(H26,Answers!C:D,2,FALSE),\"Help!\"))","v":""},null,{"$f":"IF(I26=\"\",\"\",G26+IF(I26=\"XX\",VLOOKUP(\"WRONG\",Answers!C:D,2,FALSE),I26)+J26)","v":""},{"$f":"Mainframe!E25","v":0},{"$f":"IF(L26=0,\"\",IF(NOT(ISNA(VLOOKUP(L26,Answers!E:F,2,FALSE))),VLOOKUP(L26,Answers!E:F,2,FALSE),\"Help!\"))","v":""},null,{"$f":"IF(M26=\"\",\"\",K26+IF(M26=\"XX\",VLOOKUP(\"WRONG\",Answers!E:F,2,FALSE),M26)+N26)","v":""},{"$f":"Mainframe!F25","v":0},{"$f":"IF(P26=0,\"\",IF(NOT(ISNA(VLOOKUP(P26,Answers!G:H,2,FALSE))),VLOOKUP(P26,Answers!G:H,2,FALSE),\"Help!\"))","v":""},null,{"$f":"IF(Q26=\"\",\"\",O26+IF(Q26=\"XX\",VLOOKUP(\"WRONG\",Answers!G:H,2,FALSE),Q26)+R26)","v":""},{"$f":"Mainframe!G25","v":0},{"$f":"IF(T26=0,\"\",IF(NOT(ISNA(VLOOKUP(T26,Answers!I:J,2,FALSE))),VLOOKUP(T26,Answers!I:J,2,FALSE),\"Help!\"))","v":""},null,{"$f":"IF(U26=\"\",\"\",S26+IF(U26=\"XX\",VLOOKUP(\"WRONG\",Answers!I:J,2,FALSE),U26)+V26)","v":""},{"$f":"Mainframe!H25","v":0},{"$f":"IF(X26=0,\"\",IF(NOT(ISNA(VLOOKUP(X26,Answers!K:L,2,FALSE))),VLOOKUP(X26,Answers!K:L,2,FALSE),\"Help!\"))","v":""},null,{"$f":"IF(Y26=\"\",\"\",W26+IF(Y26=\"XX\",VLOOKUP(\"WRONG\",Answers!K:L,2,FALSE),Y26)+Z26)","v":""},{"$f":"Mainframe!I25","v":0},{"$f":"IF(AB26=0,\"\",IF(NOT(ISNA(VLOOKUP(AB26,Answers!M:N,2,FALSE))),VLOOKUP(AB26,Answers!M:N,2,FALSE),\"Help!\"))","v":""},null,{"$f":"IF(AC26=\"\",\"\",AA26+IF(AC26=\"XX\",VLOOKUP(\"WRONG\",Answers!M:N,2,FALSE),AC26)+AD26)","v":""},{"$f":"Mainframe!J25","v":0},{"$f":"IF(AF26=0,\"\",IF(NOT(ISNA(VLOOKUP(AF26,Answers!O:P,2,FALSE))),VLOOKUP(AF26,Answers!O:P,2,FALSE),\"Help!\"))","v":""},null,{"$f":"IF(AG26=\"\",\"\",AE26+IF(AG26=\"XX\",VLOOKUP(\"WRONG\",Answers!O:P,2,FALSE),AG26)+AH26)","v":""},{"$f":"Mainframe!K25","v":0},{"$f":"IF(AJ26=0,\"\",IF(NOT(ISNA(VLOOKUP(AJ26,Answers!Q:R,2,FALSE))),VLOOKUP(AJ26,Answers!Q:R,2,FALSE),\"Help!\"))","v":""},null,{"$f":"IF(AK26=\"\",\"\",AI26+IF(AK26=\"XX\",VLOOKUP(\"WRONG\",Answers!Q:R,2,FALSE),AK26)+AL26)","v":""},{"$f":"Mainframe!L25","v":0},{"$f":"IF(AN26=0,\"\",IF(NOT(ISNA(VLOOKUP(AN26,Answers!S:T,2,FALSE))),VLOOKUP(AN26,Answers!S:T,2,FALSE),\"Help!\"))","v":""},null,{"$f":"IF(AO26=\"\",\"\",AM26+IF(AO26=\"XX\",VLOOKUP(\"WRONG\",Answers!S:T,2,FALSE),AO26)+AP26)","v":""},{"$f":"Mainframe!M25","v":0},{"$f":"IF(AR26=0,\"\",IF(NOT(ISNA(VLOOKUP(AR26,Answers!U:V,2,FALSE))),VLOOKUP(AR26,Answers!U:V,2,FALSE),\"Help!\"))","v":""},null,{"$f":"IF(AS26=\"\",\"\",AQ26+IF(AS26=\"XX\",VLOOKUP(\"WRONG\",Answers!U:V,2,FALSE),AS26)+AT26)","v":""},{"$f":"Mainframe!N25","v":0},{"$f":"IF(AV26=0,\"\",IF(NOT(ISNA(VLOOKUP(AV26,Answers!W:X,2,FALSE))),VLOOKUP(AV26,Answers!W:X,2,FALSE),\"Help!\"))","v":""},null,{"$f":"IF(AW26=\"\",\"\",AU26+IF(AW26=\"XX\",VLOOKUP(\"WRONG\",Answers!W:X,2,FALSE),AW26)+AX26)","v":""},{"$f":"Mainframe!O25","v":0},{"$f":"IF(AZ26=0,\"\",IF(NOT(ISNA(VLOOKUP(AZ26,Answers!Y:Z,2,FALSE))),VLOOKUP(AZ26,Answers!Y:Z,2,FALSE),\"Help!\"))","v":""},null,{"$f":"IF(BA26=\"\",\"\",AY26+IF(BA26=\"XX\",VLOOKUP(\"WRONG\",Answers!Y:Z,2,FALSE),BA26)+BB26)","v":""},{"$f":"Mainframe!P25","v":0},{"$f":"IF(BD26=0,\"\",IF(NOT(ISNA(VLOOKUP(BD26,Answers!AA:AB,2,FALSE))),VLOOKUP(BD26,Answers!AA:AB,2,FALSE),\"Help!\"))","v":""},null,{"$f":"IF(BE26=\"\",\"\",BC26+IF(BE26=\"XX\",VLOOKUP(\"WRONG\",Answers!AA:AB,2,FALSE),BE26)+BF26)","v":""},{"$f":"Mainframe!Q25","v":0},{"$f":"IF(BH26=0,\"\",IF(NOT(ISNA(VLOOKUP(BH26,Answers!AC:AD,2,FALSE))),VLOOKUP(BH26,Answers!AC:AD,2,FALSE),\"Help!\"))","v":""},null,{"$f":"IF(BI26=\"\",\"\",BG26+IF(BI26=\"XX\",VLOOKUP(\"WRONG\",Answers!AC:AD,2,FALSE),BI26)+BJ26)","v":""},{"$f":"Mainframe!R25","v":0},{"$f":"IF(BL26=0,\"\",IF(NOT(ISNA(VLOOKUP(BL26,Answers!AE:AF,2,FALSE))),VLOOKUP(BL26,Answers!AE:AF,2,FALSE),\"Help!\"))","v":""},null,{"$f":"IF(BM26=\"\",\"\",BK26+IF(BM26=\"XX\",VLOOKUP(\"WRONG\",Answers!AE:AF,2,FALSE),BM26)+BN26)","v":""},{"$f":"Mainframe!S25","v":0},{"$f":"IF(BP26=0,\"\",IF(NOT(ISNA(VLOOKUP(BP26,Answers!AG:AH,2,FALSE))),VLOOKUP(BP26,Answers!AG:AH,2,FALSE),\"Help!\"))","v":""},null,{"$f":"IF(BQ26=\"\",\"\",BO26+IF(BQ26=\"XX\",VLOOKUP(\"WRONG\",Answers!AG:AH,2,FALSE),BQ26)+BR26)","v":""},{"$f":"Mainframe!T25","v":0},{"$f":"IF(BT26=0,\"\",IF(NOT(ISNA(VLOOKUP(BT26,Answers!AI:AJ,2,FALSE))),VLOOKUP(BT26,Answers!AI:AJ,2,FALSE),\"Help!\"))","v":""},null,{"$f":"IF(BU26=\"\",\"\",BS26+IF(BU26=\"XX\",VLOOKUP(\"WRONG\",Answers!AI:AJ,2,FALSE),BU26)+BV26)","v":""},{"$f":"Mainframe!U25","v":0},{"$f":"IF(BX26=0,\"\",IF(NOT(ISNA(VLOOKUP(BX26,Answers!AK:AL,2,FALSE))),VLOOKUP(BX26,Answers!AK:AL,2,FALSE),\"Help!\"))","v":""},null,{"$f":"IF(BY26=\"\",\"\",BW26+IF(BY26=\"XX\",VLOOKUP(\"WRONG\",Answers!AK:AL,2,FALSE),BY26)+BZ26)","v":""},{"$f":"Mainframe!V25","v":0},{"$f":"IF(CB26=0,\"\",IF(NOT(ISNA(VLOOKUP(CB26,Answers!AM:AN,2,FALSE))),VLOOKUP(CB26,Answers!AM:AN,2,FALSE),\"Help!\"))","v":""},null,{"$f":"IF(CC26=\"\",\"\",CA26+IF(CC26=\"XX\",VLOOKUP(\"WRONG\",Answers!AM:AN,2,FALSE),CC26)+CD26)","v":""},null,null,"","","","",""]
["[*]",{"$f":"Mainframe!B26","v":0},25,{"$f":"Mainframe!C26","v":0},{"$f":"IF(D27=0,\"\",IF(NOT(ISNA(VLOOKUP(D27,Answers!A:B,2,FALSE))),VLOOKUP(D27,Answers!A:B,2,FALSE),\"Help!\"))","v":""},null,{"$f":"IF(E27=\"\",\"\",IF(E27=\"XX\",VLOOKUP(\"WRONG\",Answers!A:B,2,FALSE),E27)+F27)","v":""},{"$f":"Mainframe!D26","v":0},{"$f":"IF(H27=0,\"\",IF(NOT(ISNA(VLOOKUP(H27,Answers!C:D,2,FALSE))),VLOOKUP(H27,Answers!C:D,2,FALSE),\"Help!\"))","v":""},null,{"$f":"IF(I27=\"\",\"\",G27+IF(I27=\"XX\",VLOOKUP(\"WRONG\",Answers!C:D,2,FALSE),I27)+J27)","v":""},{"$f":"Mainframe!E26","v":0},{"$f":"IF(L27=0,\"\",IF(NOT(ISNA(VLOOKUP(L27,Answers!E:F,2,FALSE))),VLOOKUP(L27,Answers!E:F,2,FALSE),\"Help!\"))","v":""},null,{"$f":"IF(M27=\"\",\"\",K27+IF(M27=\"XX\",VLOOKUP(\"WRONG\",Answers!E:F,2,FALSE),M27)+N27)","v":""},{"$f":"Mainframe!F26","v":0},{"$f":"IF(P27=0,\"\",IF(NOT(ISNA(VLOOKUP(P27,Answers!G:H,2,FALSE))),VLOOKUP(P27,Answers!G:H,2,FALSE),\"Help!\"))","v":""},null,{"$f":"IF(Q27=\"\",\"\",O27+IF(Q27=\"XX\",VLOOKUP(\"WRONG\",Answers!G:H,2,FALSE),Q27)+R27)","v":""},{"$f":"Mainframe!G26","v":0},{"$f":"IF(T27=0,\"\",IF(NOT(ISNA(VLOOKUP(T27,Answers!I:J,2,FALSE))),VLOOKUP(T27,Answers!I:J,2,FALSE),\"Help!\"))","v":""},null,{"$f":"IF(U27=\"\",\"\",S27+IF(U27=\"XX\",VLOOKUP(\"WRONG\",Answers!I:J,2,FALSE),U27)+V27)","v":""},{"$f":"Mainframe!H26","v":0},{"$f":"IF(X27=0,\"\",IF(NOT(ISNA(VLOOKUP(X27,Answers!K:L,2,FALSE))),VLOOKUP(X27,Answers!K:L,2,FALSE),\"Help!\"))","v":""},null,{"$f":"IF(Y27=\"\",\"\",W27+IF(Y27=\"XX\",VLOOKUP(\"WRONG\",Answers!K:L,2,FALSE),Y27)+Z27)","v":""},{"$f":"Mainframe!I26","v":0},{"$f":"IF(AB27=0,\"\",IF(NOT(ISNA(VLOOKUP(AB27,Answers!M:N,2,FALSE))),VLOOKUP(AB27,Answers!M:N,2,FALSE),\"Help!\"))","v":""},null,{"$f":"IF(AC27=\"\",\"\",AA27+IF(AC27=\"XX\",VLOOKUP(\"WRONG\",Answers!M:N,2,FALSE),AC27)+AD27)","v":""},{"$f":"Mainframe!J26","v":0},{"$f":"IF(AF27=0,\"\",IF(NOT(ISNA(VLOOKUP(AF27,Answers!O:P,2,FALSE))),VLOOKUP(AF27,Answers!O:P,2,FALSE),\"Help!\"))","v":""},null,{"$f":"IF(AG27=\"\",\"\",AE27+IF(AG27=\"XX\",VLOOKUP(\"WRONG\",Answers!O:P,2,FALSE),AG27)+AH27)","v":""},{"$f":"Mainframe!K26","v":0},{"$f":"IF(AJ27=0,\"\",IF(NOT(ISNA(VLOOKUP(AJ27,Answers!Q:R,2,FALSE))),VLOOKUP(AJ27,Answers!Q:R,2,FALSE),\"Help!\"))","v":""},null,{"$f":"IF(AK27=\"\",\"\",AI27+IF(AK27=\"XX\",VLOOKUP(\"WRONG\",Answers!Q:R,2,FALSE),AK27)+AL27)","v":""},{"$f":"Mainframe!L26","v":0},{"$f":"IF(AN27=0,\"\",IF(NOT(ISNA(VLOOKUP(AN27,Answers!S:T,2,FALSE))),VLOOKUP(AN27,Answers!S:T,2,FALSE),\"Help!\"))","v":""},null,{"$f":"IF(AO27=\"\",\"\",AM27+IF(AO27=\"XX\",VLOOKUP(\"WRONG\",Answers!S:T,2,FALSE),AO27)+AP27)","v":""},{"$f":"Mainframe!M26","v":0},{"$f":"IF(AR27=0,\"\",IF(NOT(ISNA(VLOOKUP(AR27,Answers!U:V,2,FALSE))),VLOOKUP(AR27,Answers!U:V,2,FALSE),\"Help!\"))","v":""},null,{"$f":"IF(AS27=\"\",\"\",AQ27+IF(AS27=\"XX\",VLOOKUP(\"WRONG\",Answers!U:V,2,FALSE),AS27)+AT27)","v":""},{"$f":"Mainframe!N26","v":0},{"$f":"IF(AV27=0,\"\",IF(NOT(ISNA(VLOOKUP(AV27,Answers!W:X,2,FALSE))),VLOOKUP(AV27,Answers!W:X,2,FALSE),\"Help!\"))","v":""},null,{"$f":"IF(AW27=\"\",\"\",AU27+IF(AW27=\"XX\",VLOOKUP(\"WRONG\",Answers!W:X,2,FALSE),AW27)+AX27)","v":""},{"$f":"Mainframe!O26","v":0},{"$f":"IF(AZ27=0,\"\",IF(NOT(ISNA(VLOOKUP(AZ27,Answers!Y:Z,2,FALSE))),VLOOKUP(AZ27,Answers!Y:Z,2,FALSE),\"Help!\"))","v":""},null,{"$f":"IF(BA27=\"\",\"\",AY27+IF(BA27=\"XX\",VLOOKUP(\"WRONG\",Answers!Y:Z,2,FALSE),BA27)+BB27)","v":""},{"$f":"Mainframe!P26","v":0},{"$f":"IF(BD27=0,\"\",IF(NOT(ISNA(VLOOKUP(BD27,Answers!AA:AB,2,FALSE))),VLOOKUP(BD27,Answers!AA:AB,2,FALSE),\"Help!\"))","v":""},null,{"$f":"IF(BE27=\"\",\"\",BC27+IF(BE27=\"XX\",VLOOKUP(\"WRONG\",Answers!AA:AB,2,FALSE),BE27)+BF27)","v":""},{"$f":"Mainframe!Q26","v":0},{"$f":"IF(BH27=0,\"\",IF(NOT(ISNA(VLOOKUP(BH27,Answers!AC:AD,2,FALSE))),VLOOKUP(BH27,Answers!AC:AD,2,FALSE),\"Help!\"))","v":""},null,{"$f":"IF(BI27=\"\",\"\",BG27+IF(BI27=\"XX\",VLOOKUP(\"WRONG\",Answers!AC:AD,2,FALSE),BI27)+BJ27)","v":""},{"$f":"Mainframe!R26","v":0},{"$f":"IF(BL27=0,\"\",IF(NOT(ISNA(VLOOKUP(BL27,Answers!AE:AF,2,FALSE))),VLOOKUP(BL27,Answers!AE:AF,2,FALSE),\"Help!\"))","v":""},null,{"$f":"IF(BM27=\"\",\"\",BK27+IF(BM27=\"XX\",VLOOKUP(\"WRONG\",Answers!AE:AF,2,FALSE),BM27)+BN27)","v":""},{"$f":"Mainframe!S26","v":0},{"$f":"IF(BP27=0,\"\",IF(NOT(ISNA(VLOOKUP(BP27,Answers!AG:AH,2,FALSE))),VLOOKUP(BP27,Answers!AG:AH,2,FALSE),\"Help!\"))","v":""},null,{"$f":"IF(BQ27=\"\",\"\",BO27+IF(BQ27=\"XX\",VLOOKUP(\"WRONG\",Answers!AG:AH,2,FALSE),BQ27)+BR27)","v":""},{"$f":"Mainframe!T26","v":0},{"$f":"IF(BT27=0,\"\",IF(NOT(ISNA(VLOOKUP(BT27,Answers!AI:AJ,2,FALSE))),VLOOKUP(BT27,Answers!AI:AJ,2,FALSE),\"Help!\"))","v":""},null,{"$f":"IF(BU27=\"\",\"\",BS27+IF(BU27=\"XX\",VLOOKUP(\"WRONG\",Answers!AI:AJ,2,FALSE),BU27)+BV27)","v":""},{"$f":"Mainframe!U26","v":0},{"$f":"IF(BX27=0,\"\",IF(NOT(ISNA(VLOOKUP(BX27,Answers!AK:AL,2,FALSE))),VLOOKUP(BX27,Answers!AK:AL,2,FALSE),\"Help!\"))","v":""},null,{"$f":"IF(BY27=\"\",\"\",BW27+IF(BY27=\"XX\",VLOOKUP(\"WRONG\",Answers!AK:AL,2,FALSE),BY27)+BZ27)","v":""},{"$f":"Mainframe!V26","v":0},{"$f":"IF(CB27=0,\"\",IF(NOT(ISNA(VLOOKUP(CB27,Answers!AM:AN,2,FALSE))),VLOOKUP(CB27,Answers!AM:AN,2,FALSE),\"Help!\"))","v":""},null,{"$f":"IF(CC27=\"\",\"\",CA27+IF(CC27=\"XX\",VLOOKUP(\"WRONG\",Answers!AM:AN,2,FALSE),CC27)+CD27)","v":""},null,null,"","","","",""]
["[*]",{"$f":"Mainframe!B27","v":0},26,{"$f":"Mainframe!C27","v":0},{"$f":"IF(D28=0,\"\",IF(NOT(ISNA(VLOOKUP(D28,Answers!A:B,2,FALSE))),VLOOKUP(D28,Answers!A:B,2,FALSE),\"Help!\"))","v":""},null,{"$f":"IF(E28=\"\",\"\",IF(E28=\"XX\",VLOOKUP(\"WRONG\",Answers!A:B,2,FALSE),E28)+F28)","v":""},{"$f":"Mainframe!D27","v":0},{"$f":"IF(H28=0,\"\",IF(NOT(ISNA(VLOOKUP(H28,Answers!C:D,2,FALSE))),VLOOKUP(H28,Answers!C:D,2,FALSE),\"Help!\"))","v":""},null,{"$f":"IF(I28=\"\",\"\",G28+IF(I28=\"XX\",VLOOKUP(\"WRONG\",Answers!C:D,2,FALSE),I28)+J28)","v":""},{"$f":"Mainframe!E27","v":0},{"$f":"IF(L28=0,\"\",IF(NOT(ISNA(VLOOKUP(L28,Answers!E:F,2,FALSE))),VLOOKUP(L28,Answers!E:F,2,FALSE),\"Help!\"))","v":""},null,{"$f":"IF(M28=\"\",\"\",K28+IF(M28=\"XX\",VLOOKUP(\"WRONG\",Answers!E:F,2,FALSE),M28)+N28)","v":""},{"$f":"Mainframe!F27","v":0},{"$f":"IF(P28=0,\"\",IF(NOT(ISNA(VLOOKUP(P28,Answers!G:H,2,FALSE))),VLOOKUP(P28,Answers!G:H,2,FALSE),\"Help!\"))","v":""},null,{"$f":"IF(Q28=\"\",\"\",O28+IF(Q28=\"XX\",VLOOKUP(\"WRONG\",Answers!G:H,2,FALSE),Q28)+R28)","v":""},{"$f":"Mainframe!G27","v":0},{"$f":"IF(T28=0,\"\",IF(NOT(ISNA(VLOOKUP(T28,Answers!I:J,2,FALSE))),VLOOKUP(T28,Answers!I:J,2,FALSE),\"Help!\"))","v":""},null,{"$f":"IF(U28=\"\",\"\",S28+IF(U28=\"XX\",VLOOKUP(\"WRONG\",Answers!I:J,2,FALSE),U28)+V28)","v":""},{"$f":"Mainframe!H27","v":0},{"$f":"IF(X28=0,\"\",IF(NOT(ISNA(VLOOKUP(X28,Answers!K:L,2,FALSE))),VLOOKUP(X28,Answers!K:L,2,FALSE),\"Help!\"))","v":""},null,{"$f":"IF(Y28=\"\",\"\",W28+IF(Y28=\"XX\",VLOOKUP(\"WRONG\",Answers!K:L,2,FALSE),Y28)+Z28)","v":""},{"$f":"Mainframe!I27","v":0},{"$f":"IF(AB28=0,\"\",IF(NOT(ISNA(VLOOKUP(AB28,Answers!M:N,2,FALSE))),VLOOKUP(AB28,Answers!M:N,2,FALSE),\"Help!\"))","v":""},null,{"$f":"IF(AC28=\"\",\"\",AA28+IF(AC28=\"XX\",VLOOKUP(\"WRONG\",Answers!M:N,2,FALSE),AC28)+AD28)","v":""},{"$f":"Mainframe!J27","v":0},{"$f":"IF(AF28=0,\"\",IF(NOT(ISNA(VLOOKUP(AF28,Answers!O:P,2,FALSE))),VLOOKUP(AF28,Answers!O:P,2,FALSE),\"Help!\"))","v":""},null,{"$f":"IF(AG28=\"\",\"\",AE28+IF(AG28=\"XX\",VLOOKUP(\"WRONG\",Answers!O:P,2,FALSE),AG28)+AH28)","v":""},{"$f":"Mainframe!K27","v":0},{"$f":"IF(AJ28=0,\"\",IF(NOT(ISNA(VLOOKUP(AJ28,Answers!Q:R,2,FALSE))),VLOOKUP(AJ28,Answers!Q:R,2,FALSE),\"Help!\"))","v":""},null,{"$f":"IF(AK28=\"\",\"\",AI28+IF(AK28=\"XX\",VLOOKUP(\"WRONG\",Answers!Q:R,2,FALSE),AK28)+AL28)","v":""},{"$f":"Mainframe!L27","v":0},{"$f":"IF(AN28=0,\"\",IF(NOT(ISNA(VLOOKUP(AN28,Answers!S:T,2,FALSE))),VLOOKUP(AN28,Answers!S:T,2,FALSE),\"Help!\"))","v":""},null,{"$f":"IF(AO28=\"\",\"\",AM28+IF(AO28=\"XX\",VLOOKUP(\"WRONG\",Answers!S:T,2,FALSE),AO28)+AP28)","v":""},{"$f":"Mainframe!M27","v":0},{"$f":"IF(AR28=0,\"\",IF(NOT(ISNA(VLOOKUP(AR28,Answers!U:V,2,FALSE))),VLOOKUP(AR28,Answers!U:V,2,FALSE),\"Help!\"))","v":""},null,{"$f":"IF(AS28=\"\",\"\",AQ28+IF(AS28=\"XX\",VLOOKUP(\"WRONG\",Answers!U:V,2,FALSE),AS28)+AT28)","v":""},{"$f":"Mainframe!N27","v":0},{"$f":"IF(AV28=0,\"\",IF(NOT(ISNA(VLOOKUP(AV28,Answers!W:X,2,FALSE))),VLOOKUP(AV28,Answers!W:X,2,FALSE),\"Help!\"))","v":""},null,{"$f":"IF(AW28=\"\",\"\",AU28+IF(AW28=\"XX\",VLOOKUP(\"WRONG\",Answers!W:X,2,FALSE),AW28)+AX28)","v":""},{"$f":"Mainframe!O27","v":0},{"$f":"IF(AZ28=0,\"\",IF(NOT(ISNA(VLOOKUP(AZ28,Answers!Y:Z,2,FALSE))),VLOOKUP(AZ28,Answers!Y:Z,2,FALSE),\"Help!\"))","v":""},null,{"$f":"IF(BA28=\"\",\"\",AY28+IF(BA28=\"XX\",VLOOKUP(\"WRONG\",Answers!Y:Z,2,FALSE),BA28)+BB28)","v":""},{"$f":"Mainframe!P27","v":0},{"$f":"IF(BD28=0,\"\",IF(NOT(ISNA(VLOOKUP(BD28,Answers!AA:AB,2,FALSE))),VLOOKUP(BD28,Answers!AA:AB,2,FALSE),\"Help!\"))","v":""},null,{"$f":"IF(BE28=\"\",\"\",BC28+IF(BE28=\"XX\",VLOOKUP(\"WRONG\",Answers!AA:AB,2,FALSE),BE28)+BF28)","v":""},{"$f":"Mainframe!Q27","v":0},{"$f":"IF(BH28=0,\"\",IF(NOT(ISNA(VLOOKUP(BH28,Answers!AC:AD,2,FALSE))),VLOOKUP(BH28,Answers!AC:AD,2,FALSE),\"Help!\"))","v":""},null,{"$f":"IF(BI28=\"\",\"\",BG28+IF(BI28=\"XX\",VLOOKUP(\"WRONG\",Answers!AC:AD,2,FALSE),BI28)+BJ28)","v":""},{"$f":"Mainframe!R27","v":0},{"$f":"IF(BL28=0,\"\",IF(NOT(ISNA(VLOOKUP(BL28,Answers!AE:AF,2,FALSE))),VLOOKUP(BL28,Answers!AE:AF,2,FALSE),\"Help!\"))","v":""},null,{"$f":"IF(BM28=\"\",\"\",BK28+IF(BM28=\"XX\",VLOOKUP(\"WRONG\",Answers!AE:AF,2,FALSE),BM28)+BN28)","v":""},{"$f":"Mainframe!S27","v":0},{"$f":"IF(BP28=0,\"\",IF(NOT(ISNA(VLOOKUP(BP28,Answers!AG:AH,2,FALSE))),VLOOKUP(BP28,Answers!AG:AH,2,FALSE),\"Help!\"))","v":""},null,{"$f":"IF(BQ28=\"\",\"\",BO28+IF(BQ28=\"XX\",VLOOKUP(\"WRONG\",Answers!AG:AH,2,FALSE),BQ28)+BR28)","v":""},{"$f":"Mainframe!T27","v":0},{"$f":"IF(BT28=0,\"\",IF(NOT(ISNA(VLOOKUP(BT28,Answers!AI:AJ,2,FALSE))),VLOOKUP(BT28,Answers!AI:AJ,2,FALSE),\"Help!\"))","v":""},null,{"$f":"IF(BU28=\"\",\"\",BS28+IF(BU28=\"XX\",VLOOKUP(\"WRONG\",Answers!AI:AJ,2,FALSE),BU28)+BV28)","v":""},{"$f":"Mainframe!U27","v":0},{"$f":"IF(BX28=0,\"\",IF(NOT(ISNA(VLOOKUP(BX28,Answers!AK:AL,2,FALSE))),VLOOKUP(BX28,Answers!AK:AL,2,FALSE),\"Help!\"))","v":""},null,{"$f":"IF(BY28=\"\",\"\",BW28+IF(BY28=\"XX\",VLOOKUP(\"WRONG\",Answers!AK:AL,2,FALSE),BY28)+BZ28)","v":""},{"$f":"Mainframe!V27","v":0},{"$f":"IF(CB28=0,\"\",IF(NOT(ISNA(VLOOKUP(CB28,Answers!AM:AN,2,FALSE))),VLOOKUP(CB28,Answers!AM:AN,2,FALSE),\"Help!\"))","v":""},null,{"$f":"IF(CC28=\"\",\"\",CA28+IF(CC28=\"XX\",VLOOKUP(\"WRONG\",Answers!AM:AN,2,FALSE),CC28)+CD28)","v":""},null,null,"","","","",""]
["[*]",{"$f":"Mainframe!B28","v":0},27,{"$f":"Mainframe!C28","v":0},{"$f":"IF(D29=0,\"\",IF(NOT(ISNA(VLOOKUP(D29,Answers!A:B,2,FALSE))),VLOOKUP(D29,Answers!A:B,2,FALSE),\"Help!\"))","v":""},null,{"$f":"IF(E29=\"\",\"\",IF(E29=\"XX\",VLOOKUP(\"WRONG\",Answers!A:B,2,FALSE),E29)+F29)","v":""},{"$f":"Mainframe!D28","v":0},{"$f":"IF(H29=0,\"\",IF(NOT(ISNA(VLOOKUP(H29,Answers!C:D,2,FALSE))),VLOOKUP(H29,Answers!C:D,2,FALSE),\"Help!\"))","v":""},null,{"$f":"IF(I29=\"\",\"\",G29+IF(I29=\"XX\",VLOOKUP(\"WRONG\",Answers!C:D,2,FALSE),I29)+J29)","v":""},{"$f":"Mainframe!E28","v":0},{"$f":"IF(L29=0,\"\",IF(NOT(ISNA(VLOOKUP(L29,Answers!E:F,2,FALSE))),VLOOKUP(L29,Answers!E:F,2,FALSE),\"Help!\"))","v":""},null,{"$f":"IF(M29=\"\",\"\",K29+IF(M29=\"XX\",VLOOKUP(\"WRONG\",Answers!E:F,2,FALSE),M29)+N29)","v":""},{"$f":"Mainframe!F28","v":0},{"$f":"IF(P29=0,\"\",IF(NOT(ISNA(VLOOKUP(P29,Answers!G:H,2,FALSE))),VLOOKUP(P29,Answers!G:H,2,FALSE),\"Help!\"))","v":""},null,{"$f":"IF(Q29=\"\",\"\",O29+IF(Q29=\"XX\",VLOOKUP(\"WRONG\",Answers!G:H,2,FALSE),Q29)+R29)","v":""},{"$f":"Mainframe!G28","v":0},{"$f":"IF(T29=0,\"\",IF(NOT(ISNA(VLOOKUP(T29,Answers!I:J,2,FALSE))),VLOOKUP(T29,Answers!I:J,2,FALSE),\"Help!\"))","v":""},null,{"$f":"IF(U29=\"\",\"\",S29+IF(U29=\"XX\",VLOOKUP(\"WRONG\",Answers!I:J,2,FALSE),U29)+V29)","v":""},{"$f":"Mainframe!H28","v":0},{"$f":"IF(X29=0,\"\",IF(NOT(ISNA(VLOOKUP(X29,Answers!K:L,2,FALSE))),VLOOKUP(X29,Answers!K:L,2,FALSE),\"Help!\"))","v":""},null,{"$f":"IF(Y29=\"\",\"\",W29+IF(Y29=\"XX\",VLOOKUP(\"WRONG\",Answers!K:L,2,FALSE),Y29)+Z29)","v":""},{"$f":"Mainframe!I28","v":0},{"$f":"IF(AB29=0,\"\",IF(NOT(ISNA(VLOOKUP(AB29,Answers!M:N,2,FALSE))),VLOOKUP(AB29,Answers!M:N,2,FALSE),\"Help!\"))","v":""},null,{"$f":"IF(AC29=\"\",\"\",AA29+IF(AC29=\"XX\",VLOOKUP(\"WRONG\",Answers!M:N,2,FALSE),AC29)+AD29)","v":""},{"$f":"Mainframe!J28","v":0},{"$f":"IF(AF29=0,\"\",IF(NOT(ISNA(VLOOKUP(AF29,Answers!O:P,2,FALSE))),VLOOKUP(AF29,Answers!O:P,2,FALSE),\"Help!\"))","v":""},null,{"$f":"IF(AG29=\"\",\"\",AE29+IF(AG29=\"XX\",VLOOKUP(\"WRONG\",Answers!O:P,2,FALSE),AG29)+AH29)","v":""},{"$f":"Mainframe!K28","v":0},{"$f":"IF(AJ29=0,\"\",IF(NOT(ISNA(VLOOKUP(AJ29,Answers!Q:R,2,FALSE))),VLOOKUP(AJ29,Answers!Q:R,2,FALSE),\"Help!\"))","v":""},null,{"$f":"IF(AK29=\"\",\"\",AI29+IF(AK29=\"XX\",VLOOKUP(\"WRONG\",Answers!Q:R,2,FALSE),AK29)+AL29)","v":""},{"$f":"Mainframe!L28","v":0},{"$f":"IF(AN29=0,\"\",IF(NOT(ISNA(VLOOKUP(AN29,Answers!S:T,2,FALSE))),VLOOKUP(AN29,Answers!S:T,2,FALSE),\"Help!\"))","v":""},null,{"$f":"IF(AO29=\"\",\"\",AM29+IF(AO29=\"XX\",VLOOKUP(\"WRONG\",Answers!S:T,2,FALSE),AO29)+AP29)","v":""},{"$f":"Mainframe!M28","v":0},{"$f":"IF(AR29=0,\"\",IF(NOT(ISNA(VLOOKUP(AR29,Answers!U:V,2,FALSE))),VLOOKUP(AR29,Answers!U:V,2,FALSE),\"Help!\"))","v":""},null,{"$f":"IF(AS29=\"\",\"\",AQ29+IF(AS29=\"XX\",VLOOKUP(\"WRONG\",Answers!U:V,2,FALSE),AS29)+AT29)","v":""},{"$f":"Mainframe!N28","v":0},{"$f":"IF(AV29=0,\"\",IF(NOT(ISNA(VLOOKUP(AV29,Answers!W:X,2,FALSE))),VLOOKUP(AV29,Answers!W:X,2,FALSE),\"Help!\"))","v":""},null,{"$f":"IF(AW29=\"\",\"\",AU29+IF(AW29=\"XX\",VLOOKUP(\"WRONG\",Answers!W:X,2,FALSE),AW29)+AX29)","v":""},{"$f":"Mainframe!O28","v":0},{"$f":"IF(AZ29=0,\"\",IF(NOT(ISNA(VLOOKUP(AZ29,Answers!Y:Z,2,FALSE))),VLOOKUP(AZ29,Answers!Y:Z,2,FALSE),\"Help!\"))","v":""},null,{"$f":"IF(BA29=\"\",\"\",AY29+IF(BA29=\"XX\",VLOOKUP(\"WRONG\",Answers!Y:Z,2,FALSE),BA29)+BB29)","v":""},{"$f":"Mainframe!P28","v":0},{"$f":"IF(BD29=0,\"\",IF(NOT(ISNA(VLOOKUP(BD29,Answers!AA:AB,2,FALSE))),VLOOKUP(BD29,Answers!AA:AB,2,FALSE),\"Help!\"))","v":""},null,{"$f":"IF(BE29=\"\",\"\",BC29+IF(BE29=\"XX\",VLOOKUP(\"WRONG\",Answers!AA:AB,2,FALSE),BE29)+BF29)","v":""},{"$f":"Mainframe!Q28","v":0},{"$f":"IF(BH29=0,\"\",IF(NOT(ISNA(VLOOKUP(BH29,Answers!AC:AD,2,FALSE))),VLOOKUP(BH29,Answers!AC:AD,2,FALSE),\"Help!\"))","v":""},null,{"$f":"IF(BI29=\"\",\"\",BG29+IF(BI29=\"XX\",VLOOKUP(\"WRONG\",Answers!AC:AD,2,FALSE),BI29)+BJ29)","v":""},{"$f":"Mainframe!R28","v":0},{"$f":"IF(BL29=0,\"\",IF(NOT(ISNA(VLOOKUP(BL29,Answers!AE:AF,2,FALSE))),VLOOKUP(BL29,Answers!AE:AF,2,FALSE),\"Help!\"))","v":""},null,{"$f":"IF(BM29=\"\",\"\",BK29+IF(BM29=\"XX\",VLOOKUP(\"WRONG\",Answers!AE:AF,2,FALSE),BM29)+BN29)","v":""},{"$f":"Mainframe!S28","v":0},{"$f":"IF(BP29=0,\"\",IF(NOT(ISNA(VLOOKUP(BP29,Answers!AG:AH,2,FALSE))),VLOOKUP(BP29,Answers!AG:AH,2,FALSE),\"Help!\"))","v":""},null,{"$f":"IF(BQ29=\"\",\"\",BO29+IF(BQ29=\"XX\",VLOOKUP(\"WRONG\",Answers!AG:AH,2,FALSE),BQ29)+BR29)","v":""},{"$f":"Mainframe!T28","v":0},{"$f":"IF(BT29=0,\"\",IF(NOT(ISNA(VLOOKUP(BT29,Answers!AI:AJ,2,FALSE))),VLOOKUP(BT29,Answers!AI:AJ,2,FALSE),\"Help!\"))","v":""},null,{"$f":"IF(BU29=\"\",\"\",BS29+IF(BU29=\"XX\",VLOOKUP(\"WRONG\",Answers!AI:AJ,2,FALSE),BU29)+BV29)","v":""},{"$f":"Mainframe!U28","v":0},{"$f":"IF(BX29=0,\"\",IF(NOT(ISNA(VLOOKUP(BX29,Answers!AK:AL,2,FALSE))),VLOOKUP(BX29,Answers!AK:AL,2,FALSE),\"Help!\"))","v":""},null,{"$f":"IF(BY29=\"\",\"\",BW29+IF(BY29=\"XX\",VLOOKUP(\"WRONG\",Answers!AK:AL,2,FALSE),BY29)+BZ29)","v":""},{"$f":"Mainframe!V28","v":0},{"$f":"IF(CB29=0,\"\",IF(NOT(ISNA(VLOOKUP(CB29,Answers!AM:AN,2,FALSE))),VLOOKUP(CB29,Answers!AM:AN,2,FALSE),\"Help!\"))","v":""},null,{"$f":"IF(CC29=\"\",\"\",CA29+IF(CC29=\"XX\",VLOOKUP(\"WRONG\",Answers!AM:AN,2,FALSE),CC29)+CD29)","v":""},null,null,"","","","",""]
["[*]",{"$f":"Mainframe!B29","v":0},28,{"$f":"Mainframe!C29","v":0},{"$f":"IF(D30=0,\"\",IF(NOT(ISNA(VLOOKUP(D30,Answers!A:B,2,FALSE))),VLOOKUP(D30,Answers!A:B,2,FALSE),\"Help!\"))","v":""},null,{"$f":"IF(E30=\"\",\"\",IF(E30=\"XX\",VLOOKUP(\"WRONG\",Answers!A:B,2,FALSE),E30)+F30)","v":""},{"$f":"Mainframe!D29","v":0},{"$f":"IF(H30=0,\"\",IF(NOT(ISNA(VLOOKUP(H30,Answers!C:D,2,FALSE))),VLOOKUP(H30,Answers!C:D,2,FALSE),\"Help!\"))","v":""},null,{"$f":"IF(I30=\"\",\"\",G30+IF(I30=\"XX\",VLOOKUP(\"WRONG\",Answers!C:D,2,FALSE),I30)+J30)","v":""},{"$f":"Mainframe!E29","v":0},{"$f":"IF(L30=0,\"\",IF(NOT(ISNA(VLOOKUP(L30,Answers!E:F,2,FALSE))),VLOOKUP(L30,Answers!E:F,2,FALSE),\"Help!\"))","v":""},null,{"$f":"IF(M30=\"\",\"\",K30+IF(M30=\"XX\",VLOOKUP(\"WRONG\",Answers!E:F,2,FALSE),M30)+N30)","v":""},{"$f":"Mainframe!F29","v":0},{"$f":"IF(P30=0,\"\",IF(NOT(ISNA(VLOOKUP(P30,Answers!G:H,2,FALSE))),VLOOKUP(P30,Answers!G:H,2,FALSE),\"Help!\"))","v":""},null,{"$f":"IF(Q30=\"\",\"\",O30+IF(Q30=\"XX\",VLOOKUP(\"WRONG\",Answers!G:H,2,FALSE),Q30)+R30)","v":""},{"$f":"Mainframe!G29","v":0},{"$f":"IF(T30=0,\"\",IF(NOT(ISNA(VLOOKUP(T30,Answers!I:J,2,FALSE))),VLOOKUP(T30,Answers!I:J,2,FALSE),\"Help!\"))","v":""},null,{"$f":"IF(U30=\"\",\"\",S30+IF(U30=\"XX\",VLOOKUP(\"WRONG\",Answers!I:J,2,FALSE),U30)+V30)","v":""},{"$f":"Mainframe!H29","v":0},{"$f":"IF(X30=0,\"\",IF(NOT(ISNA(VLOOKUP(X30,Answers!K:L,2,FALSE))),VLOOKUP(X30,Answers!K:L,2,FALSE),\"Help!\"))","v":""},null,{"$f":"IF(Y30=\"\",\"\",W30+IF(Y30=\"XX\",VLOOKUP(\"WRONG\",Answers!K:L,2,FALSE),Y30)+Z30)","v":""},{"$f":"Mainframe!I29","v":0},{"$f":"IF(AB30=0,\"\",IF(NOT(ISNA(VLOOKUP(AB30,Answers!M:N,2,FALSE))),VLOOKUP(AB30,Answers!M:N,2,FALSE),\"Help!\"))","v":""},null,{"$f":"IF(AC30=\"\",\"\",AA30+IF(AC30=\"XX\",VLOOKUP(\"WRONG\",Answers!M:N,2,FALSE),AC30)+AD30)","v":""},{"$f":"Mainframe!J29","v":0},{"$f":"IF(AF30=0,\"\",IF(NOT(ISNA(VLOOKUP(AF30,Answers!O:P,2,FALSE))),VLOOKUP(AF30,Answers!O:P,2,FALSE),\"Help!\"))","v":""},null,{"$f":"IF(AG30=\"\",\"\",AE30+IF(AG30=\"XX\",VLOOKUP(\"WRONG\",Answers!O:P,2,FALSE),AG30)+AH30)","v":""},{"$f":"Mainframe!K29","v":0},{"$f":"IF(AJ30=0,\"\",IF(NOT(ISNA(VLOOKUP(AJ30,Answers!Q:R,2,FALSE))),VLOOKUP(AJ30,Answers!Q:R,2,FALSE),\"Help!\"))","v":""},null,{"$f":"IF(AK30=\"\",\"\",AI30+IF(AK30=\"XX\",VLOOKUP(\"WRONG\",Answers!Q:R,2,FALSE),AK30)+AL30)","v":""},{"$f":"Mainframe!L29","v":0},{"$f":"IF(AN30=0,\"\",IF(NOT(ISNA(VLOOKUP(AN30,Answers!S:T,2,FALSE))),VLOOKUP(AN30,Answers!S:T,2,FALSE),\"Help!\"))","v":""},null,{"$f":"IF(AO30=\"\",\"\",AM30+IF(AO30=\"XX\",VLOOKUP(\"WRONG\",Answers!S:T,2,FALSE),AO30)+AP30)","v":""},{"$f":"Mainframe!M29","v":0},{"$f":"IF(AR30=0,\"\",IF(NOT(ISNA(VLOOKUP(AR30,Answers!U:V,2,FALSE))),VLOOKUP(AR30,Answers!U:V,2,FALSE),\"Help!\"))","v":""},null,{"$f":"IF(AS30=\"\",\"\",AQ30+IF(AS30=\"XX\",VLOOKUP(\"WRONG\",Answers!U:V,2,FALSE),AS30)+AT30)","v":""},{"$f":"Mainframe!N29","v":0},{"$f":"IF(AV30=0,\"\",IF(NOT(ISNA(VLOOKUP(AV30,Answers!W:X,2,FALSE))),VLOOKUP(AV30,Answers!W:X,2,FALSE),\"Help!\"))","v":""},null,{"$f":"IF(AW30=\"\",\"\",AU30+IF(AW30=\"XX\",VLOOKUP(\"WRONG\",Answers!W:X,2,FALSE),AW30)+AX30)","v":""},{"$f":"Mainframe!O29","v":0},{"$f":"IF(AZ30=0,\"\",IF(NOT(ISNA(VLOOKUP(AZ30,Answers!Y:Z,2,FALSE))),VLOOKUP(AZ30,Answers!Y:Z,2,FALSE),\"Help!\"))","v":""},null,{"$f":"IF(BA30=\"\",\"\",AY30+IF(BA30=\"XX\",VLOOKUP(\"WRONG\",Answers!Y:Z,2,FALSE),BA30)+BB30)","v":""},{"$f":"Mainframe!P29","v":0},{"$f":"IF(BD30=0,\"\",IF(NOT(ISNA(VLOOKUP(BD30,Answers!AA:AB,2,FALSE))),VLOOKUP(BD30,Answers!AA:AB,2,FALSE),\"Help!\"))","v":""},null,{"$f":"IF(BE30=\"\",\"\",BC30+IF(BE30=\"XX\",VLOOKUP(\"WRONG\",Answers!AA:AB,2,FALSE),BE30)+BF30)","v":""},{"$f":"Mainframe!Q29","v":0},{"$f":"IF(BH30=0,\"\",IF(NOT(ISNA(VLOOKUP(BH30,Answers!AC:AD,2,FALSE))),VLOOKUP(BH30,Answers!AC:AD,2,FALSE),\"Help!\"))","v":""},null,{"$f":"IF(BI30=\"\",\"\",BG30+IF(BI30=\"XX\",VLOOKUP(\"WRONG\",Answers!AC:AD,2,FALSE),BI30)+BJ30)","v":""},{"$f":"Mainframe!R29","v":0},{"$f":"IF(BL30=0,\"\",IF(NOT(ISNA(VLOOKUP(BL30,Answers!AE:AF,2,FALSE))),VLOOKUP(BL30,Answers!AE:AF,2,FALSE),\"Help!\"))","v":""},null,{"$f":"IF(BM30=\"\",\"\",BK30+IF(BM30=\"XX\",VLOOKUP(\"WRONG\",Answers!AE:AF,2,FALSE),BM30)+BN30)","v":""},{"$f":"Mainframe!S29","v":0},{"$f":"IF(BP30=0,\"\",IF(NOT(ISNA(VLOOKUP(BP30,Answers!AG:AH,2,FALSE))),VLOOKUP(BP30,Answers!AG:AH,2,FALSE),\"Help!\"))","v":""},null,{"$f":"IF(BQ30=\"\",\"\",BO30+IF(BQ30=\"XX\",VLOOKUP(\"WRONG\",Answers!AG:AH,2,FALSE),BQ30)+BR30)","v":""},{"$f":"Mainframe!T29","v":0},{"$f":"IF(BT30=0,\"\",IF(NOT(ISNA(VLOOKUP(BT30,Answers!AI:AJ,2,FALSE))),VLOOKUP(BT30,Answers!AI:AJ,2,FALSE),\"Help!\"))","v":""},null,{"$f":"IF(BU30=\"\",\"\",BS30+IF(BU30=\"XX\",VLOOKUP(\"WRONG\",Answers!AI:AJ,2,FALSE),BU30)+BV30)","v":""},{"$f":"Mainframe!U29","v":0},{"$f":"IF(BX30=0,\"\",IF(NOT(ISNA(VLOOKUP(BX30,Answers!AK:AL,2,FALSE))),VLOOKUP(BX30,Answers!AK:AL,2,FALSE),\"Help!\"))","v":""},null,{"$f":"IF(BY30=\"\",\"\",BW30+IF(BY30=\"XX\",VLOOKUP(\"WRONG\",Answers!AK:AL,2,FALSE),BY30)+BZ30)","v":""},{"$f":"Mainframe!V29","v":0},{"$f":"IF(CB30=0,\"\",IF(NOT(ISNA(VLOOKUP(CB30,Answers!AM:AN,2,FALSE))),VLOOKUP(CB30,Answers!AM:AN,2,FALSE),\"Help!\"))","v":""},null,{"$f":"IF(CC30=\"\",\"\",CA30+IF(CC30=\"XX\",VLOOKUP(\"WRONG\",Answers!AM:AN,2,FALSE),CC30)+CD30)","v":""},null,null,"","","","",""]
["[*]",{"$f":"Mainframe!B30","v":0},29,{"$f":"Mainframe!C30","v":0},{"$f":"IF(D31=0,\"\",IF(NOT(ISNA(VLOOKUP(D31,Answers!A:B,2,FALSE))),VLOOKUP(D31,Answers!A:B,2,FALSE),\"Help!\"))","v":""},null,{"$f":"IF(E31=\"\",\"\",IF(E31=\"XX\",VLOOKUP(\"WRONG\",Answers!A:B,2,FALSE),E31)+F31)","v":""},{"$f":"Mainframe!D30","v":0},{"$f":"IF(H31=0,\"\",IF(NOT(ISNA(VLOOKUP(H31,Answers!C:D,2,FALSE))),VLOOKUP(H31,Answers!C:D,2,FALSE),\"Help!\"))","v":""},null,{"$f":"IF(I31=\"\",\"\",G31+IF(I31=\"XX\",VLOOKUP(\"WRONG\",Answers!C:D,2,FALSE),I31)+J31)","v":""},{"$f":"Mainframe!E30","v":0},{"$f":"IF(L31=0,\"\",IF(NOT(ISNA(VLOOKUP(L31,Answers!E:F,2,FALSE))),VLOOKUP(L31,Answers!E:F,2,FALSE),\"Help!\"))","v":""},null,{"$f":"IF(M31=\"\",\"\",K31+IF(M31=\"XX\",VLOOKUP(\"WRONG\",Answers!E:F,2,FALSE),M31)+N31)","v":""},{"$f":"Mainframe!F30","v":0},{"$f":"IF(P31=0,\"\",IF(NOT(ISNA(VLOOKUP(P31,Answers!G:H,2,FALSE))),VLOOKUP(P31,Answers!G:H,2,FALSE),\"Help!\"))","v":""},null,{"$f":"IF(Q31=\"\",\"\",O31+IF(Q31=\"XX\",VLOOKUP(\"WRONG\",Answers!G:H,2,FALSE),Q31)+R31)","v":""},{"$f":"Mainframe!G30","v":0},{"$f":"IF(T31=0,\"\",IF(NOT(ISNA(VLOOKUP(T31,Answers!I:J,2,FALSE))),VLOOKUP(T31,Answers!I:J,2,FALSE),\"Help!\"))","v":""},null,{"$f":"IF(U31=\"\",\"\",S31+IF(U31=\"XX\",VLOOKUP(\"WRONG\",Answers!I:J,2,FALSE),U31)+V31)","v":""},{"$f":"Mainframe!H30","v":0},{"$f":"IF(X31=0,\"\",IF(NOT(ISNA(VLOOKUP(X31,Answers!K:L,2,FALSE))),VLOOKUP(X31,Answers!K:L,2,FALSE),\"Help!\"))","v":""},null,{"$f":"IF(Y31=\"\",\"\",W31+IF(Y31=\"XX\",VLOOKUP(\"WRONG\",Answers!K:L,2,FALSE),Y31)+Z31)","v":""},{"$f":"Mainframe!I30","v":0},{"$f":"IF(AB31=0,\"\",IF(NOT(ISNA(VLOOKUP(AB31,Answers!M:N,2,FALSE))),VLOOKUP(AB31,Answers!M:N,2,FALSE),\"Help!\"))","v":""},null,{"$f":"IF(AC31=\"\",\"\",AA31+IF(AC31=\"XX\",VLOOKUP(\"WRONG\",Answers!M:N,2,FALSE),AC31)+AD31)","v":""},{"$f":"Mainframe!J30","v":0},{"$f":"IF(AF31=0,\"\",IF(NOT(ISNA(VLOOKUP(AF31,Answers!O:P,2,FALSE))),VLOOKUP(AF31,Answers!O:P,2,FALSE),\"Help!\"))","v":""},null,{"$f":"IF(AG31=\"\",\"\",AE31+IF(AG31=\"XX\",VLOOKUP(\"WRONG\",Answers!O:P,2,FALSE),AG31)+AH31)","v":""},{"$f":"Mainframe!K30","v":0},{"$f":"IF(AJ31=0,\"\",IF(NOT(ISNA(VLOOKUP(AJ31,Answers!Q:R,2,FALSE))),VLOOKUP(AJ31,Answers!Q:R,2,FALSE),\"Help!\"))","v":""},null,{"$f":"IF(AK31=\"\",\"\",AI31+IF(AK31=\"XX\",VLOOKUP(\"WRONG\",Answers!Q:R,2,FALSE),AK31)+AL31)","v":""},{"$f":"Mainframe!L30","v":0},{"$f":"IF(AN31=0,\"\",IF(NOT(ISNA(VLOOKUP(AN31,Answers!S:T,2,FALSE))),VLOOKUP(AN31,Answers!S:T,2,FALSE),\"Help!\"))","v":""},null,{"$f":"IF(AO31=\"\",\"\",AM31+IF(AO31=\"XX\",VLOOKUP(\"WRONG\",Answers!S:T,2,FALSE),AO31)+AP31)","v":""},{"$f":"Mainframe!M30","v":0},{"$f":"IF(AR31=0,\"\",IF(NOT(ISNA(VLOOKUP(AR31,Answers!U:V,2,FALSE))),VLOOKUP(AR31,Answers!U:V,2,FALSE),\"Help!\"))","v":""},null,{"$f":"IF(AS31=\"\",\"\",AQ31+IF(AS31=\"XX\",VLOOKUP(\"WRONG\",Answers!U:V,2,FALSE),AS31)+AT31)","v":""},{"$f":"Mainframe!N30","v":0},{"$f":"IF(AV31=0,\"\",IF(NOT(ISNA(VLOOKUP(AV31,Answers!W:X,2,FALSE))),VLOOKUP(AV31,Answers!W:X,2,FALSE),\"Help!\"))","v":""},null,{"$f":"IF(AW31=\"\",\"\",AU31+IF(AW31=\"XX\",VLOOKUP(\"WRONG\",Answers!W:X,2,FALSE),AW31)+AX31)","v":""},{"$f":"Mainframe!O30","v":0},{"$f":"IF(AZ31=0,\"\",IF(NOT(ISNA(VLOOKUP(AZ31,Answers!Y:Z,2,FALSE))),VLOOKUP(AZ31,Answers!Y:Z,2,FALSE),\"Help!\"))","v":""},null,{"$f":"IF(BA31=\"\",\"\",AY31+IF(BA31=\"XX\",VLOOKUP(\"WRONG\",Answers!Y:Z,2,FALSE),BA31)+BB31)","v":""},{"$f":"Mainframe!P30","v":0},{"$f":"IF(BD31=0,\"\",IF(NOT(ISNA(VLOOKUP(BD31,Answers!AA:AB,2,FALSE))),VLOOKUP(BD31,Answers!AA:AB,2,FALSE),\"Help!\"))","v":""},null,{"$f":"IF(BE31=\"\",\"\",BC31+IF(BE31=\"XX\",VLOOKUP(\"WRONG\",Answers!AA:AB,2,FALSE),BE31)+BF31)","v":""},{"$f":"Mainframe!Q30","v":0},{"$f":"IF(BH31=0,\"\",IF(NOT(ISNA(VLOOKUP(BH31,Answers!AC:AD,2,FALSE))),VLOOKUP(BH31,Answers!AC:AD,2,FALSE),\"Help!\"))","v":""},null,{"$f":"IF(BI31=\"\",\"\",BG31+IF(BI31=\"XX\",VLOOKUP(\"WRONG\",Answers!AC:AD,2,FALSE),BI31)+BJ31)","v":""},{"$f":"Mainframe!R30","v":0},{"$f":"IF(BL31=0,\"\",IF(NOT(ISNA(VLOOKUP(BL31,Answers!AE:AF,2,FALSE))),VLOOKUP(BL31,Answers!AE:AF,2,FALSE),\"Help!\"))","v":""},null,{"$f":"IF(BM31=\"\",\"\",BK31+IF(BM31=\"XX\",VLOOKUP(\"WRONG\",Answers!AE:AF,2,FALSE),BM31)+BN31)","v":""},{"$f":"Mainframe!S30","v":0},{"$f":"IF(BP31=0,\"\",IF(NOT(ISNA(VLOOKUP(BP31,Answers!AG:AH,2,FALSE))),VLOOKUP(BP31,Answers!AG:AH,2,FALSE),\"Help!\"))","v":""},null,{"$f":"IF(BQ31=\"\",\"\",BO31+IF(BQ31=\"XX\",VLOOKUP(\"WRONG\",Answers!AG:AH,2,FALSE),BQ31)+BR31)","v":""},{"$f":"Mainframe!T30","v":0},{"$f":"IF(BT31=0,\"\",IF(NOT(ISNA(VLOOKUP(BT31,Answers!AI:AJ,2,FALSE))),VLOOKUP(BT31,Answers!AI:AJ,2,FALSE),\"Help!\"))","v":""},null,{"$f":"IF(BU31=\"\",\"\",BS31+IF(BU31=\"XX\",VLOOKUP(\"WRONG\",Answers!AI:AJ,2,FALSE),BU31)+BV31)","v":""},{"$f":"Mainframe!U30","v":0},{"$f":"IF(BX31=0,\"\",IF(NOT(ISNA(VLOOKUP(BX31,Answers!AK:AL,2,FALSE))),VLOOKUP(BX31,Answers!AK:AL,2,FALSE),\"Help!\"))","v":""},null,{"$f":"IF(BY31=\"\",\"\",BW31+IF(BY31=\"XX\",VLOOKUP(\"WRONG\",Answers!AK:AL,2,FALSE),BY31)+BZ31)","v":""},{"$f":"Mainframe!V30","v":0},{"$f":"IF(CB31=0,\"\",IF(NOT(ISNA(VLOOKUP(CB31,Answers!AM:AN,2,FALSE))),VLOOKUP(CB31,Answers!AM:AN,2,FALSE),\"Help!\"))","v":""},null,{"$f":"IF(CC31=\"\",\"\",CA31+IF(CC31=\"XX\",VLOOKUP(\"WRONG\",Answers!AM:AN,2,FALSE),CC31)+CD31)","v":""},null,null,"","","","",""]
["[*]",{"$f":"Mainframe!B31","v":0},30,{"$f":"Mainframe!C31","v":0},{"$f":"IF(D32=0,\"\",IF(NOT(ISNA(VLOOKUP(D32,Answers!A:B,2,FALSE))),VLOOKUP(D32,Answers!A:B,2,FALSE),\"Help!\"))","v":""},null,{"$f":"IF(E32=\"\",\"\",IF(E32=\"XX\",VLOOKUP(\"WRONG\",Answers!A:B,2,FALSE),E32)+F32)","v":""},{"$f":"Mainframe!D31","v":0},{"$f":"IF(H32=0,\"\",IF(NOT(ISNA(VLOOKUP(H32,Answers!C:D,2,FALSE))),VLOOKUP(H32,Answers!C:D,2,FALSE),\"Help!\"))","v":""},null,{"$f":"IF(I32=\"\",\"\",G32+IF(I32=\"XX\",VLOOKUP(\"WRONG\",Answers!C:D,2,FALSE),I32)+J32)","v":""},{"$f":"Mainframe!E31","v":0},{"$f":"IF(L32=0,\"\",IF(NOT(ISNA(VLOOKUP(L32,Answers!E:F,2,FALSE))),VLOOKUP(L32,Answers!E:F,2,FALSE),\"Help!\"))","v":""},null,{"$f":"IF(M32=\"\",\"\",K32+IF(M32=\"XX\",VLOOKUP(\"WRONG\",Answers!E:F,2,FALSE),M32)+N32)","v":""},{"$f":"Mainframe!F31","v":0},{"$f":"IF(P32=0,\"\",IF(NOT(ISNA(VLOOKUP(P32,Answers!G:H,2,FALSE))),VLOOKUP(P32,Answers!G:H,2,FALSE),\"Help!\"))","v":""},null,{"$f":"IF(Q32=\"\",\"\",O32+IF(Q32=\"XX\",VLOOKUP(\"WRONG\",Answers!G:H,2,FALSE),Q32)+R32)","v":""},{"$f":"Mainframe!G31","v":0},{"$f":"IF(T32=0,\"\",IF(NOT(ISNA(VLOOKUP(T32,Answers!I:J,2,FALSE))),VLOOKUP(T32,Answers!I:J,2,FALSE),\"Help!\"))","v":""},null,{"$f":"IF(U32=\"\",\"\",S32+IF(U32=\"XX\",VLOOKUP(\"WRONG\",Answers!I:J,2,FALSE),U32)+V32)","v":""},{"$f":"Mainframe!H31","v":0},{"$f":"IF(X32=0,\"\",IF(NOT(ISNA(VLOOKUP(X32,Answers!K:L,2,FALSE))),VLOOKUP(X32,Answers!K:L,2,FALSE),\"Help!\"))","v":""},null,{"$f":"IF(Y32=\"\",\"\",W32+IF(Y32=\"XX\",VLOOKUP(\"WRONG\",Answers!K:L,2,FALSE),Y32)+Z32)","v":""},{"$f":"Mainframe!I31","v":0},{"$f":"IF(AB32=0,\"\",IF(NOT(ISNA(VLOOKUP(AB32,Answers!M:N,2,FALSE))),VLOOKUP(AB32,Answers!M:N,2,FALSE),\"Help!\"))","v":""},null,{"$f":"IF(AC32=\"\",\"\",AA32+IF(AC32=\"XX\",VLOOKUP(\"WRONG\",Answers!M:N,2,FALSE),AC32)+AD32)","v":""},{"$f":"Mainframe!J31","v":0},{"$f":"IF(AF32=0,\"\",IF(NOT(ISNA(VLOOKUP(AF32,Answers!O:P,2,FALSE))),VLOOKUP(AF32,Answers!O:P,2,FALSE),\"Help!\"))","v":""},null,{"$f":"IF(AG32=\"\",\"\",AE32+IF(AG32=\"XX\",VLOOKUP(\"WRONG\",Answers!O:P,2,FALSE),AG32)+AH32)","v":""},{"$f":"Mainframe!K31","v":0},{"$f":"IF(AJ32=0,\"\",IF(NOT(ISNA(VLOOKUP(AJ32,Answers!Q:R,2,FALSE))),VLOOKUP(AJ32,Answers!Q:R,2,FALSE),\"Help!\"))","v":""},null,{"$f":"IF(AK32=\"\",\"\",AI32+IF(AK32=\"XX\",VLOOKUP(\"WRONG\",Answers!Q:R,2,FALSE),AK32)+AL32)","v":""},{"$f":"Mainframe!L31","v":0},{"$f":"IF(AN32=0,\"\",IF(NOT(ISNA(VLOOKUP(AN32,Answers!S:T,2,FALSE))),VLOOKUP(AN32,Answers!S:T,2,FALSE),\"Help!\"))","v":""},null,{"$f":"IF(AO32=\"\",\"\",AM32+IF(AO32=\"XX\",VLOOKUP(\"WRONG\",Answers!S:T,2,FALSE),AO32)+AP32)","v":""},{"$f":"Mainframe!M31","v":0},{"$f":"IF(AR32=0,\"\",IF(NOT(ISNA(VLOOKUP(AR32,Answers!U:V,2,FALSE))),VLOOKUP(AR32,Answers!U:V,2,FALSE),\"Help!\"))","v":""},null,{"$f":"IF(AS32=\"\",\"\",AQ32+IF(AS32=\"XX\",VLOOKUP(\"WRONG\",Answers!U:V,2,FALSE),AS32)+AT32)","v":""},{"$f":"Mainframe!N31","v":0},{"$f":"IF(AV32=0,\"\",IF(NOT(ISNA(VLOOKUP(AV32,Answers!W:X,2,FALSE))),VLOOKUP(AV32,Answers!W:X,2,FALSE),\"Help!\"))","v":""},null,{"$f":"IF(AW32=\"\",\"\",AU32+IF(AW32=\"XX\",VLOOKUP(\"WRONG\",Answers!W:X,2,FALSE),AW32)+AX32)","v":""},{"$f":"Mainframe!O31","v":0},{"$f":"IF(AZ32=0,\"\",IF(NOT(ISNA(VLOOKUP(AZ32,Answers!Y:Z,2,FALSE))),VLOOKUP(AZ32,Answers!Y:Z,2,FALSE),\"Help!\"))","v":""},null,{"$f":"IF(BA32=\"\",\"\",AY32+IF(BA32=\"XX\",VLOOKUP(\"WRONG\",Answers!Y:Z,2,FALSE),BA32)+BB32)","v":""},{"$f":"Mainframe!P31","v":0},{"$f":"IF(BD32=0,\"\",IF(NOT(ISNA(VLOOKUP(BD32,Answers!AA:AB,2,FALSE))),VLOOKUP(BD32,Answers!AA:AB,2,FALSE),\"Help!\"))","v":""},null,{"$f":"IF(BE32=\"\",\"\",BC32+IF(BE32=\"XX\",VLOOKUP(\"WRONG\",Answers!AA:AB,2,FALSE),BE32)+BF32)","v":""},{"$f":"Mainframe!Q31","v":0},{"$f":"IF(BH32=0,\"\",IF(NOT(ISNA(VLOOKUP(BH32,Answers!AC:AD,2,FALSE))),VLOOKUP(BH32,Answers!AC:AD,2,FALSE),\"Help!\"))","v":""},null,{"$f":"IF(BI32=\"\",\"\",BG32+IF(BI32=\"XX\",VLOOKUP(\"WRONG\",Answers!AC:AD,2,FALSE),BI32)+BJ32)","v":""},{"$f":"Mainframe!R31","v":0},{"$f":"IF(BL32=0,\"\",IF(NOT(ISNA(VLOOKUP(BL32,Answers!AE:AF,2,FALSE))),VLOOKUP(BL32,Answers!AE:AF,2,FALSE),\"Help!\"))","v":""},null,{"$f":"IF(BM32=\"\",\"\",BK32+IF(BM32=\"XX\",VLOOKUP(\"WRONG\",Answers!AE:AF,2,FALSE),BM32)+BN32)","v":""},{"$f":"Mainframe!S31","v":0},{"$f":"IF(BP32=0,\"\",IF(NOT(ISNA(VLOOKUP(BP32,Answers!AG:AH,2,FALSE))),VLOOKUP(BP32,Answers!AG:AH,2,FALSE),\"Help!\"))","v":""},null,{"$f":"IF(BQ32=\"\",\"\",BO32+IF(BQ32=\"XX\",VLOOKUP(\"WRONG\",Answers!AG:AH,2,FALSE),BQ32)+BR32)","v":""},{"$f":"Mainframe!T31","v":0},{"$f":"IF(BT32=0,\"\",IF(NOT(ISNA(VLOOKUP(BT32,Answers!AI:AJ,2,FALSE))),VLOOKUP(BT32,Answers!AI:AJ,2,FALSE),\"Help!\"))","v":""},null,{"$f":"IF(BU32=\"\",\"\",BS32+IF(BU32=\"XX\",VLOOKUP(\"WRONG\",Answers!AI:AJ,2,FALSE),BU32)+BV32)","v":""},{"$f":"Mainframe!U31","v":0},{"$f":"IF(BX32=0,\"\",IF(NOT(ISNA(VLOOKUP(BX32,Answers!AK:AL,2,FALSE))),VLOOKUP(BX32,Answers!AK:AL,2,FALSE),\"Help!\"))","v":""},null,{"$f":"IF(BY32=\"\",\"\",BW32+IF(BY32=\"XX\",VLOOKUP(\"WRONG\",Answers!AK:AL,2,FALSE),BY32)+BZ32)","v":""},{"$f":"Mainframe!V31","v":0},{"$f":"IF(CB32=0,\"\",IF(NOT(ISNA(VLOOKUP(CB32,Answers!AM:AN,2,FALSE))),VLOOKUP(CB32,Answers!AM:AN,2,FALSE),\"Help!\"))","v":""},null,{"$f":"IF(CC32=\"\",\"\",CA32+IF(CC32=\"XX\",VLOOKUP(\"WRONG\",Answers!AM:AN,2,FALSE),CC32)+CD32)","v":""},null,null,"","","","",""]
["[*]",{"$f":"Mainframe!B32","v":0},31,{"$f":"Mainframe!C32","v":0},{"$f":"IF(D33=0,\"\",IF(NOT(ISNA(VLOOKUP(D33,Answers!A:B,2,FALSE))),VLOOKUP(D33,Answers!A:B,2,FALSE),\"Help!\"))","v":""},null,{"$f":"IF(E33=\"\",\"\",IF(E33=\"XX\",VLOOKUP(\"WRONG\",Answers!A:B,2,FALSE),E33)+F33)","v":""},{"$f":"Mainframe!D32","v":0},{"$f":"IF(H33=0,\"\",IF(NOT(ISNA(VLOOKUP(H33,Answers!C:D,2,FALSE))),VLOOKUP(H33,Answers!C:D,2,FALSE),\"Help!\"))","v":""},null,{"$f":"IF(I33=\"\",\"\",G33+IF(I33=\"XX\",VLOOKUP(\"WRONG\",Answers!C:D,2,FALSE),I33)+J33)","v":""},{"$f":"Mainframe!E32","v":0},{"$f":"IF(L33=0,\"\",IF(NOT(ISNA(VLOOKUP(L33,Answers!E:F,2,FALSE))),VLOOKUP(L33,Answers!E:F,2,FALSE),\"Help!\"))","v":""},null,{"$f":"IF(M33=\"\",\"\",K33+IF(M33=\"XX\",VLOOKUP(\"WRONG\",Answers!E:F,2,FALSE),M33)+N33)","v":""},{"$f":"Mainframe!F32","v":0},{"$f":"IF(P33=0,\"\",IF(NOT(ISNA(VLOOKUP(P33,Answers!G:H,2,FALSE))),VLOOKUP(P33,Answers!G:H,2,FALSE),\"Help!\"))","v":""},null,{"$f":"IF(Q33=\"\",\"\",O33+IF(Q33=\"XX\",VLOOKUP(\"WRONG\",Answers!G:H,2,FALSE),Q33)+R33)","v":""},{"$f":"Mainframe!G32","v":0},{"$f":"IF(T33=0,\"\",IF(NOT(ISNA(VLOOKUP(T33,Answers!I:J,2,FALSE))),VLOOKUP(T33,Answers!I:J,2,FALSE),\"Help!\"))","v":""},null,{"$f":"IF(U33=\"\",\"\",S33+IF(U33=\"XX\",VLOOKUP(\"WRONG\",Answers!I:J,2,FALSE),U33)+V33)","v":""},{"$f":"Mainframe!H32","v":0},{"$f":"IF(X33=0,\"\",IF(NOT(ISNA(VLOOKUP(X33,Answers!K:L,2,FALSE))),VLOOKUP(X33,Answers!K:L,2,FALSE),\"Help!\"))","v":""},null,{"$f":"IF(Y33=\"\",\"\",W33+IF(Y33=\"XX\",VLOOKUP(\"WRONG\",Answers!K:L,2,FALSE),Y33)+Z33)","v":""},{"$f":"Mainframe!I32","v":0},{"$f":"IF(AB33=0,\"\",IF(NOT(ISNA(VLOOKUP(AB33,Answers!M:N,2,FALSE))),VLOOKUP(AB33,Answers!M:N,2,FALSE),\"Help!\"))","v":""},null,{"$f":"IF(AC33=\"\",\"\",AA33+IF(AC33=\"XX\",VLOOKUP(\"WRONG\",Answers!M:N,2,FALSE),AC33)+AD33)","v":""},{"$f":"Mainframe!J32","v":0},{"$f":"IF(AF33=0,\"\",IF(NOT(ISNA(VLOOKUP(AF33,Answers!O:P,2,FALSE))),VLOOKUP(AF33,Answers!O:P,2,FALSE),\"Help!\"))","v":""},null,{"$f":"IF(AG33=\"\",\"\",AE33+IF(AG33=\"XX\",VLOOKUP(\"WRONG\",Answers!O:P,2,FALSE),AG33)+AH33)","v":""},{"$f":"Mainframe!K32","v":0},{"$f":"IF(AJ33=0,\"\",IF(NOT(ISNA(VLOOKUP(AJ33,Answers!Q:R,2,FALSE))),VLOOKUP(AJ33,Answers!Q:R,2,FALSE),\"Help!\"))","v":""},null,{"$f":"IF(AK33=\"\",\"\",AI33+IF(AK33=\"XX\",VLOOKUP(\"WRONG\",Answers!Q:R,2,FALSE),AK33)+AL33)","v":""},{"$f":"Mainframe!L32","v":0},{"$f":"IF(AN33=0,\"\",IF(NOT(ISNA(VLOOKUP(AN33,Answers!S:T,2,FALSE))),VLOOKUP(AN33,Answers!S:T,2,FALSE),\"Help!\"))","v":""},null,{"$f":"IF(AO33=\"\",\"\",AM33+IF(AO33=\"XX\",VLOOKUP(\"WRONG\",Answers!S:T,2,FALSE),AO33)+AP33)","v":""},{"$f":"Mainframe!M32","v":0},{"$f":"IF(AR33=0,\"\",IF(NOT(ISNA(VLOOKUP(AR33,Answers!U:V,2,FALSE))),VLOOKUP(AR33,Answers!U:V,2,FALSE),\"Help!\"))","v":""},null,{"$f":"IF(AS33=\"\",\"\",AQ33+IF(AS33=\"XX\",VLOOKUP(\"WRONG\",Answers!U:V,2,FALSE),AS33)+AT33)","v":""},{"$f":"Mainframe!N32","v":0},{"$f":"IF(AV33=0,\"\",IF(NOT(ISNA(VLOOKUP(AV33,Answers!W:X,2,FALSE))),VLOOKUP(AV33,Answers!W:X,2,FALSE),\"Help!\"))","v":""},null,{"$f":"IF(AW33=\"\",\"\",AU33+IF(AW33=\"XX\",VLOOKUP(\"WRONG\",Answers!W:X,2,FALSE),AW33)+AX33)","v":""},{"$f":"Mainframe!O32","v":0},{"$f":"IF(AZ33=0,\"\",IF(NOT(ISNA(VLOOKUP(AZ33,Answers!Y:Z,2,FALSE))),VLOOKUP(AZ33,Answers!Y:Z,2,FALSE),\"Help!\"))","v":""},null,{"$f":"IF(BA33=\"\",\"\",AY33+IF(BA33=\"XX\",VLOOKUP(\"WRONG\",Answers!Y:Z,2,FALSE),BA33)+BB33)","v":""},{"$f":"Mainframe!P32","v":0},{"$f":"IF(BD33=0,\"\",IF(NOT(ISNA(VLOOKUP(BD33,Answers!AA:AB,2,FALSE))),VLOOKUP(BD33,Answers!AA:AB,2,FALSE),\"Help!\"))","v":""},null,{"$f":"IF(BE33=\"\",\"\",BC33+IF(BE33=\"XX\",VLOOKUP(\"WRONG\",Answers!AA:AB,2,FALSE),BE33)+BF33)","v":""},{"$f":"Mainframe!Q32","v":0},{"$f":"IF(BH33=0,\"\",IF(NOT(ISNA(VLOOKUP(BH33,Answers!AC:AD,2,FALSE))),VLOOKUP(BH33,Answers!AC:AD,2,FALSE),\"Help!\"))","v":""},null,{"$f":"IF(BI33=\"\",\"\",BG33+IF(BI33=\"XX\",VLOOKUP(\"WRONG\",Answers!AC:AD,2,FALSE),BI33)+BJ33)","v":""},{"$f":"Mainframe!R32","v":0},{"$f":"IF(BL33=0,\"\",IF(NOT(ISNA(VLOOKUP(BL33,Answers!AE:AF,2,FALSE))),VLOOKUP(BL33,Answers!AE:AF,2,FALSE),\"Help!\"))","v":""},null,{"$f":"IF(BM33=\"\",\"\",BK33+IF(BM33=\"XX\",VLOOKUP(\"WRONG\",Answers!AE:AF,2,FALSE),BM33)+BN33)","v":""},{"$f":"Mainframe!S32","v":0},{"$f":"IF(BP33=0,\"\",IF(NOT(ISNA(VLOOKUP(BP33,Answers!AG:AH,2,FALSE))),VLOOKUP(BP33,Answers!AG:AH,2,FALSE),\"Help!\"))","v":""},null,{"$f":"IF(BQ33=\"\",\"\",BO33+IF(BQ33=\"XX\",VLOOKUP(\"WRONG\",Answers!AG:AH,2,FALSE),BQ33)+BR33)","v":""},{"$f":"Mainframe!T32","v":0},{"$f":"IF(BT33=0,\"\",IF(NOT(ISNA(VLOOKUP(BT33,Answers!AI:AJ,2,FALSE))),VLOOKUP(BT33,Answers!AI:AJ,2,FALSE),\"Help!\"))","v":""},null,{"$f":"IF(BU33=\"\",\"\",BS33+IF(BU33=\"XX\",VLOOKUP(\"WRONG\",Answers!AI:AJ,2,FALSE),BU33)+BV33)","v":""},{"$f":"Mainframe!U32","v":0},{"$f":"IF(BX33=0,\"\",IF(NOT(ISNA(VLOOKUP(BX33,Answers!AK:AL,2,FALSE))),VLOOKUP(BX33,Answers!AK:AL,2,FALSE),\"Help!\"))","v":""},null,{"$f":"IF(BY33=\"\",\"\",BW33+IF(BY33=\"XX\",VLOOKUP(\"WRONG\",Answers!AK:AL,2,FALSE),BY33)+BZ33)","v":""},{"$f":"Mainframe!V32","v":0},{"$f":"IF(CB33=0,\"\",IF(NOT(ISNA(VLOOKUP(CB33,Answers!AM:AN,2,FALSE))),VLOOKUP(CB33,Answers!AM:AN,2,FALSE),\"Help!\"))","v":""},null,{"$f":"IF(CC33=\"\",\"\",CA33+IF(CC33=\"XX\",VLOOKUP(\"WRONG\",Answers!AM:AN,2,FALSE),CC33)+CD33)","v":""},null,null,"","","","",""]
["[*]",{"$f":"Mainframe!B33","v":0},32,{"$f":"Mainframe!C33","v":0},{"$f":"IF(D34=0,\"\",IF(NOT(ISNA(VLOOKUP(D34,Answers!A:B,2,FALSE))),VLOOKUP(D34,Answers!A:B,2,FALSE),\"Help!\"))","v":""},null,{"$f":"IF(E34=\"\",\"\",IF(E34=\"XX\",VLOOKUP(\"WRONG\",Answers!A:B,2,FALSE),E34)+F34)","v":""},{"$f":"Mainframe!D33","v":0},{"$f":"IF(H34=0,\"\",IF(NOT(ISNA(VLOOKUP(H34,Answers!C:D,2,FALSE))),VLOOKUP(H34,Answers!C:D,2,FALSE),\"Help!\"))","v":""},null,{"$f":"IF(I34=\"\",\"\",G34+IF(I34=\"XX\",VLOOKUP(\"WRONG\",Answers!C:D,2,FALSE),I34)+J34)","v":""},{"$f":"Mainframe!E33","v":0},{"$f":"IF(L34=0,\"\",IF(NOT(ISNA(VLOOKUP(L34,Answers!E:F,2,FALSE))),VLOOKUP(L34,Answers!E:F,2,FALSE),\"Help!\"))","v":""},null,{"$f":"IF(M34=\"\",\"\",K34+IF(M34=\"XX\",VLOOKUP(\"WRONG\",Answers!E:F,2,FALSE),M34)+N34)","v":""},{"$f":"Mainframe!F33","v":0},{"$f":"IF(P34=0,\"\",IF(NOT(ISNA(VLOOKUP(P34,Answers!G:H,2,FALSE))),VLOOKUP(P34,Answers!G:H,2,FALSE),\"Help!\"))","v":""},null,{"$f":"IF(Q34=\"\",\"\",O34+IF(Q34=\"XX\",VLOOKUP(\"WRONG\",Answers!G:H,2,FALSE),Q34)+R34)","v":""},{"$f":"Mainframe!G33","v":0},{"$f":"IF(T34=0,\"\",IF(NOT(ISNA(VLOOKUP(T34,Answers!I:J,2,FALSE))),VLOOKUP(T34,Answers!I:J,2,FALSE),\"Help!\"))","v":""},null,{"$f":"IF(U34=\"\",\"\",S34+IF(U34=\"XX\",VLOOKUP(\"WRONG\",Answers!I:J,2,FALSE),U34)+V34)","v":""},{"$f":"Mainframe!H33","v":0},{"$f":"IF(X34=0,\"\",IF(NOT(ISNA(VLOOKUP(X34,Answers!K:L,2,FALSE))),VLOOKUP(X34,Answers!K:L,2,FALSE),\"Help!\"))","v":""},null,{"$f":"IF(Y34=\"\",\"\",W34+IF(Y34=\"XX\",VLOOKUP(\"WRONG\",Answers!K:L,2,FALSE),Y34)+Z34)","v":""},{"$f":"Mainframe!I33","v":0},{"$f":"IF(AB34=0,\"\",IF(NOT(ISNA(VLOOKUP(AB34,Answers!M:N,2,FALSE))),VLOOKUP(AB34,Answers!M:N,2,FALSE),\"Help!\"))","v":""},null,{"$f":"IF(AC34=\"\",\"\",AA34+IF(AC34=\"XX\",VLOOKUP(\"WRONG\",Answers!M:N,2,FALSE),AC34)+AD34)","v":""},{"$f":"Mainframe!J33","v":0},{"$f":"IF(AF34=0,\"\",IF(NOT(ISNA(VLOOKUP(AF34,Answers!O:P,2,FALSE))),VLOOKUP(AF34,Answers!O:P,2,FALSE),\"Help!\"))","v":""},null,{"$f":"IF(AG34=\"\",\"\",AE34+IF(AG34=\"XX\",VLOOKUP(\"WRONG\",Answers!O:P,2,FALSE),AG34)+AH34)","v":""},{"$f":"Mainframe!K33","v":0},{"$f":"IF(AJ34=0,\"\",IF(NOT(ISNA(VLOOKUP(AJ34,Answers!Q:R,2,FALSE))),VLOOKUP(AJ34,Answers!Q:R,2,FALSE),\"Help!\"))","v":""},null,{"$f":"IF(AK34=\"\",\"\",AI34+IF(AK34=\"XX\",VLOOKUP(\"WRONG\",Answers!Q:R,2,FALSE),AK34)+AL34)","v":""},{"$f":"Mainframe!L33","v":0},{"$f":"IF(AN34=0,\"\",IF(NOT(ISNA(VLOOKUP(AN34,Answers!S:T,2,FALSE))),VLOOKUP(AN34,Answers!S:T,2,FALSE),\"Help!\"))","v":""},null,{"$f":"IF(AO34=\"\",\"\",AM34+IF(AO34=\"XX\",VLOOKUP(\"WRONG\",Answers!S:T,2,FALSE),AO34)+AP34)","v":""},{"$f":"Mainframe!M33","v":0},{"$f":"IF(AR34=0,\"\",IF(NOT(ISNA(VLOOKUP(AR34,Answers!U:V,2,FALSE))),VLOOKUP(AR34,Answers!U:V,2,FALSE),\"Help!\"))","v":""},null,{"$f":"IF(AS34=\"\",\"\",AQ34+IF(AS34=\"XX\",VLOOKUP(\"WRONG\",Answers!U:V,2,FALSE),AS34)+AT34)","v":""},{"$f":"Mainframe!N33","v":0},{"$f":"IF(AV34=0,\"\",IF(NOT(ISNA(VLOOKUP(AV34,Answers!W:X,2,FALSE))),VLOOKUP(AV34,Answers!W:X,2,FALSE),\"Help!\"))","v":""},null,{"$f":"IF(AW34=\"\",\"\",AU34+IF(AW34=\"XX\",VLOOKUP(\"WRONG\",Answers!W:X,2,FALSE),AW34)+AX34)","v":""},{"$f":"Mainframe!O33","v":0},{"$f":"IF(AZ34=0,\"\",IF(NOT(ISNA(VLOOKUP(AZ34,Answers!Y:Z,2,FALSE))),VLOOKUP(AZ34,Answers!Y:Z,2,FALSE),\"Help!\"))","v":""},null,{"$f":"IF(BA34=\"\",\"\",AY34+IF(BA34=\"XX\",VLOOKUP(\"WRONG\",Answers!Y:Z,2,FALSE),BA34)+BB34)","v":""},{"$f":"Mainframe!P33","v":0},{"$f":"IF(BD34=0,\"\",IF(NOT(ISNA(VLOOKUP(BD34,Answers!AA:AB,2,FALSE))),VLOOKUP(BD34,Answers!AA:AB,2,FALSE),\"Help!\"))","v":""},null,{"$f":"IF(BE34=\"\",\"\",BC34+IF(BE34=\"XX\",VLOOKUP(\"WRONG\",Answers!AA:AB,2,FALSE),BE34)+BF34)","v":""},{"$f":"Mainframe!Q33","v":0},{"$f":"IF(BH34=0,\"\",IF(NOT(ISNA(VLOOKUP(BH34,Answers!AC:AD,2,FALSE))),VLOOKUP(BH34,Answers!AC:AD,2,FALSE),\"Help!\"))","v":""},null,{"$f":"IF(BI34=\"\",\"\",BG34+IF(BI34=\"XX\",VLOOKUP(\"WRONG\",Answers!AC:AD,2,FALSE),BI34)+BJ34)","v":""},{"$f":"Mainframe!R33","v":0},{"$f":"IF(BL34=0,\"\",IF(NOT(ISNA(VLOOKUP(BL34,Answers!AE:AF,2,FALSE))),VLOOKUP(BL34,Answers!AE:AF,2,FALSE),\"Help!\"))","v":""},null,{"$f":"IF(BM34=\"\",\"\",BK34+IF(BM34=\"XX\",VLOOKUP(\"WRONG\",Answers!AE:AF,2,FALSE),BM34)+BN34)","v":""},{"$f":"Mainframe!S33","v":0},{"$f":"IF(BP34=0,\"\",IF(NOT(ISNA(VLOOKUP(BP34,Answers!AG:AH,2,FALSE))),VLOOKUP(BP34,Answers!AG:AH,2,FALSE),\"Help!\"))","v":""},null,{"$f":"IF(BQ34=\"\",\"\",BO34+IF(BQ34=\"XX\",VLOOKUP(\"WRONG\",Answers!AG:AH,2,FALSE),BQ34)+BR34)","v":""},{"$f":"Mainframe!T33","v":0},{"$f":"IF(BT34=0,\"\",IF(NOT(ISNA(VLOOKUP(BT34,Answers!AI:AJ,2,FALSE))),VLOOKUP(BT34,Answers!AI:AJ,2,FALSE),\"Help!\"))","v":""},null,{"$f":"IF(BU34=\"\",\"\",BS34+IF(BU34=\"XX\",VLOOKUP(\"WRONG\",Answers!AI:AJ,2,FALSE),BU34)+BV34)","v":""},{"$f":"Mainframe!U33","v":0},{"$f":"IF(BX34=0,\"\",IF(NOT(ISNA(VLOOKUP(BX34,Answers!AK:AL,2,FALSE))),VLOOKUP(BX34,Answers!AK:AL,2,FALSE),\"Help!\"))","v":""},null,{"$f":"IF(BY34=\"\",\"\",BW34+IF(BY34=\"XX\",VLOOKUP(\"WRONG\",Answers!AK:AL,2,FALSE),BY34)+BZ34)","v":""},{"$f":"Mainframe!V33","v":0},{"$f":"IF(CB34=0,\"\",IF(NOT(ISNA(VLOOKUP(CB34,Answers!AM:AN,2,FALSE))),VLOOKUP(CB34,Answers!AM:AN,2,FALSE),\"Help!\"))","v":""},null,{"$f":"IF(CC34=\"\",\"\",CA34+IF(CC34=\"XX\",VLOOKUP(\"WRONG\",Answers!AM:AN,2,FALSE),CC34)+CD34)","v":""},null,null,"","","","",""]
["[*]",{"$f":"Mainframe!B34","v":0},33,{"$f":"Mainframe!C34","v":0},{"$f":"IF(D35=0,\"\",IF(NOT(ISNA(VLOOKUP(D35,Answers!A:B,2,FALSE))),VLOOKUP(D35,Answers!A:B,2,FALSE),\"Help!\"))","v":""},null,{"$f":"IF(E35=\"\",\"\",IF(E35=\"XX\",VLOOKUP(\"WRONG\",Answers!A:B,2,FALSE),E35)+F35)","v":""},{"$f":"Mainframe!D34","v":0},{"$f":"IF(H35=0,\"\",IF(NOT(ISNA(VLOOKUP(H35,Answers!C:D,2,FALSE))),VLOOKUP(H35,Answers!C:D,2,FALSE),\"Help!\"))","v":""},null,{"$f":"IF(I35=\"\",\"\",G35+IF(I35=\"XX\",VLOOKUP(\"WRONG\",Answers!C:D,2,FALSE),I35)+J35)","v":""},{"$f":"Mainframe!E34","v":0},{"$f":"IF(L35=0,\"\",IF(NOT(ISNA(VLOOKUP(L35,Answers!E:F,2,FALSE))),VLOOKUP(L35,Answers!E:F,2,FALSE),\"Help!\"))","v":""},null,{"$f":"IF(M35=\"\",\"\",K35+IF(M35=\"XX\",VLOOKUP(\"WRONG\",Answers!E:F,2,FALSE),M35)+N35)","v":""},{"$f":"Mainframe!F34","v":0},{"$f":"IF(P35=0,\"\",IF(NOT(ISNA(VLOOKUP(P35,Answers!G:H,2,FALSE))),VLOOKUP(P35,Answers!G:H,2,FALSE),\"Help!\"))","v":""},null,{"$f":"IF(Q35=\"\",\"\",O35+IF(Q35=\"XX\",VLOOKUP(\"WRONG\",Answers!G:H,2,FALSE),Q35)+R35)","v":""},{"$f":"Mainframe!G34","v":0},{"$f":"IF(T35=0,\"\",IF(NOT(ISNA(VLOOKUP(T35,Answers!I:J,2,FALSE))),VLOOKUP(T35,Answers!I:J,2,FALSE),\"Help!\"))","v":""},null,{"$f":"IF(U35=\"\",\"\",S35+IF(U35=\"XX\",VLOOKUP(\"WRONG\",Answers!I:J,2,FALSE),U35)+V35)","v":""},{"$f":"Mainframe!H34","v":0},{"$f":"IF(X35=0,\"\",IF(NOT(ISNA(VLOOKUP(X35,Answers!K:L,2,FALSE))),VLOOKUP(X35,Answers!K:L,2,FALSE),\"Help!\"))","v":""},null,{"$f":"IF(Y35=\"\",\"\",W35+IF(Y35=\"XX\",VLOOKUP(\"WRONG\",Answers!K:L,2,FALSE),Y35)+Z35)","v":""},{"$f":"Mainframe!I34","v":0},{"$f":"IF(AB35=0,\"\",IF(NOT(ISNA(VLOOKUP(AB35,Answers!M:N,2,FALSE))),VLOOKUP(AB35,Answers!M:N,2,FALSE),\"Help!\"))","v":""},null,{"$f":"IF(AC35=\"\",\"\",AA35+IF(AC35=\"XX\",VLOOKUP(\"WRONG\",Answers!M:N,2,FALSE),AC35)+AD35)","v":""},{"$f":"Mainframe!J34","v":0},{"$f":"IF(AF35=0,\"\",IF(NOT(ISNA(VLOOKUP(AF35,Answers!O:P,2,FALSE))),VLOOKUP(AF35,Answers!O:P,2,FALSE),\"Help!\"))","v":""},null,{"$f":"IF(AG35=\"\",\"\",AE35+IF(AG35=\"XX\",VLOOKUP(\"WRONG\",Answers!O:P,2,FALSE),AG35)+AH35)","v":""},{"$f":"Mainframe!K34","v":0},{"$f":"IF(AJ35=0,\"\",IF(NOT(ISNA(VLOOKUP(AJ35,Answers!Q:R,2,FALSE))),VLOOKUP(AJ35,Answers!Q:R,2,FALSE),\"Help!\"))","v":""},null,{"$f":"IF(AK35=\"\",\"\",AI35+IF(AK35=\"XX\",VLOOKUP(\"WRONG\",Answers!Q:R,2,FALSE),AK35)+AL35)","v":""},{"$f":"Mainframe!L34","v":0},{"$f":"IF(AN35=0,\"\",IF(NOT(ISNA(VLOOKUP(AN35,Answers!S:T,2,FALSE))),VLOOKUP(AN35,Answers!S:T,2,FALSE),\"Help!\"))","v":""},null,{"$f":"IF(AO35=\"\",\"\",AM35+IF(AO35=\"XX\",VLOOKUP(\"WRONG\",Answers!S:T,2,FALSE),AO35)+AP35)","v":""},{"$f":"Mainframe!M34","v":0},{"$f":"IF(AR35=0,\"\",IF(NOT(ISNA(VLOOKUP(AR35,Answers!U:V,2,FALSE))),VLOOKUP(AR35,Answers!U:V,2,FALSE),\"Help!\"))","v":""},null,{"$f":"IF(AS35=\"\",\"\",AQ35+IF(AS35=\"XX\",VLOOKUP(\"WRONG\",Answers!U:V,2,FALSE),AS35)+AT35)","v":""},{"$f":"Mainframe!N34","v":0},{"$f":"IF(AV35=0,\"\",IF(NOT(ISNA(VLOOKUP(AV35,Answers!W:X,2,FALSE))),VLOOKUP(AV35,Answers!W:X,2,FALSE),\"Help!\"))","v":""},null,{"$f":"IF(AW35=\"\",\"\",AU35+IF(AW35=\"XX\",VLOOKUP(\"WRONG\",Answers!W:X,2,FALSE),AW35)+AX35)","v":""},{"$f":"Mainframe!O34","v":0},{"$f":"IF(AZ35=0,\"\",IF(NOT(ISNA(VLOOKUP(AZ35,Answers!Y:Z,2,FALSE))),VLOOKUP(AZ35,Answers!Y:Z,2,FALSE),\"Help!\"))","v":""},null,{"$f":"IF(BA35=\"\",\"\",AY35+IF(BA35=\"XX\",VLOOKUP(\"WRONG\",Answers!Y:Z,2,FALSE),BA35)+BB35)","v":""},{"$f":"Mainframe!P34","v":0},{"$f":"IF(BD35=0,\"\",IF(NOT(ISNA(VLOOKUP(BD35,Answers!AA:AB,2,FALSE))),VLOOKUP(BD35,Answers!AA:AB,2,FALSE),\"Help!\"))","v":""},null,{"$f":"IF(BE35=\"\",\"\",BC35+IF(BE35=\"XX\",VLOOKUP(\"WRONG\",Answers!AA:AB,2,FALSE),BE35)+BF35)","v":""},{"$f":"Mainframe!Q34","v":0},{"$f":"IF(BH35=0,\"\",IF(NOT(ISNA(VLOOKUP(BH35,Answers!AC:AD,2,FALSE))),VLOOKUP(BH35,Answers!AC:AD,2,FALSE),\"Help!\"))","v":""},null,{"$f":"IF(BI35=\"\",\"\",BG35+IF(BI35=\"XX\",VLOOKUP(\"WRONG\",Answers!AC:AD,2,FALSE),BI35)+BJ35)","v":""},{"$f":"Mainframe!R34","v":0},{"$f":"IF(BL35=0,\"\",IF(NOT(ISNA(VLOOKUP(BL35,Answers!AE:AF,2,FALSE))),VLOOKUP(BL35,Answers!AE:AF,2,FALSE),\"Help!\"))","v":""},null,{"$f":"IF(BM35=\"\",\"\",BK35+IF(BM35=\"XX\",VLOOKUP(\"WRONG\",Answers!AE:AF,2,FALSE),BM35)+BN35)","v":""},{"$f":"Mainframe!S34","v":0},{"$f":"IF(BP35=0,\"\",IF(NOT(ISNA(VLOOKUP(BP35,Answers!AG:AH,2,FALSE))),VLOOKUP(BP35,Answers!AG:AH,2,FALSE),\"Help!\"))","v":""},null,{"$f":"IF(BQ35=\"\",\"\",BO35+IF(BQ35=\"XX\",VLOOKUP(\"WRONG\",Answers!AG:AH,2,FALSE),BQ35)+BR35)","v":""},{"$f":"Mainframe!T34","v":0},{"$f":"IF(BT35=0,\"\",IF(NOT(ISNA(VLOOKUP(BT35,Answers!AI:AJ,2,FALSE))),VLOOKUP(BT35,Answers!AI:AJ,2,FALSE),\"Help!\"))","v":""},null,{"$f":"IF(BU35=\"\",\"\",BS35+IF(BU35=\"XX\",VLOOKUP(\"WRONG\",Answers!AI:AJ,2,FALSE),BU35)+BV35)","v":""},{"$f":"Mainframe!U34","v":0},{"$f":"IF(BX35=0,\"\",IF(NOT(ISNA(VLOOKUP(BX35,Answers!AK:AL,2,FALSE))),VLOOKUP(BX35,Answers!AK:AL,2,FALSE),\"Help!\"))","v":""},null,{"$f":"IF(BY35=\"\",\"\",BW35+IF(BY35=\"XX\",VLOOKUP(\"WRONG\",Answers!AK:AL,2,FALSE),BY35)+BZ35)","v":""},{"$f":"Mainframe!V34","v":0},{"$f":"IF(CB35=0,\"\",IF(NOT(ISNA(VLOOKUP(CB35,Answers!AM:AN,2,FALSE))),VLOOKUP(CB35,Answers!AM:AN,2,FALSE),\"Help!\"))","v":""},null,{"$f":"IF(CC35=\"\",\"\",CA35+IF(CC35=\"XX\",VLOOKUP(\"WRONG\",Answers!AM:AN,2,FALSE),CC35)+CD35)","v":""},null,null,{"$f":"IF(B35=0,\"\",IF(INDEX($B:$CE,ROW(),1)=0,\"\",IF(INDEX($B:$CE,ROW(),4*$CH$1+2)=INDEX($B:$CE,ROW()-1,4*$CH$1+2),$CH34,ROW()-2)))","v":""},"","","",{"$f":"IF(B35=0,\"\",CONCATENATE(INDEX($CH:$CL,ROW(),1), \". \", INDEX($B:$CE,ROW(),1), \" — [b]\", INDEX($B:$CE,ROW(),$CH$1*4+2),\"[/b] pts\"))","v":""}]
["[*]",{"$f":"Mainframe!B35","v":0},34,{"$f":"Mainframe!C35","v":0},{"$f":"IF(D36=0,\"\",IF(NOT(ISNA(VLOOKUP(D36,Answers!A:B,2,FALSE))),VLOOKUP(D36,Answers!A:B,2,FALSE),\"Help!\"))","v":""},null,{"$f":"IF(E36=\"\",\"\",IF(E36=\"XX\",VLOOKUP(\"WRONG\",Answers!A:B,2,FALSE),E36)+F36)","v":""},{"$f":"Mainframe!D35","v":0},{"$f":"IF(H36=0,\"\",IF(NOT(ISNA(VLOOKUP(H36,Answers!C:D,2,FALSE))),VLOOKUP(H36,Answers!C:D,2,FALSE),\"Help!\"))","v":""},null,{"$f":"IF(I36=\"\",\"\",G36+IF(I36=\"XX\",VLOOKUP(\"WRONG\",Answers!C:D,2,FALSE),I36)+J36)","v":""},{"$f":"Mainframe!E35","v":0},{"$f":"IF(L36=0,\"\",IF(NOT(ISNA(VLOOKUP(L36,Answers!E:F,2,FALSE))),VLOOKUP(L36,Answers!E:F,2,FALSE),\"Help!\"))","v":""},null,{"$f":"IF(M36=\"\",\"\",K36+IF(M36=\"XX\",VLOOKUP(\"WRONG\",Answers!E:F,2,FALSE),M36)+N36)","v":""},{"$f":"Mainframe!F35","v":0},{"$f":"IF(P36=0,\"\",IF(NOT(ISNA(VLOOKUP(P36,Answers!G:H,2,FALSE))),VLOOKUP(P36,Answers!G:H,2,FALSE),\"Help!\"))","v":""},null,{"$f":"IF(Q36=\"\",\"\",O36+IF(Q36=\"XX\",VLOOKUP(\"WRONG\",Answers!G:H,2,FALSE),Q36)+R36)","v":""},{"$f":"Mainframe!G35","v":0},{"$f":"IF(T36=0,\"\",IF(NOT(ISNA(VLOOKUP(T36,Answers!I:J,2,FALSE))),VLOOKUP(T36,Answers!I:J,2,FALSE),\"Help!\"))","v":""},null,{"$f":"IF(U36=\"\",\"\",S36+IF(U36=\"XX\",VLOOKUP(\"WRONG\",Answers!I:J,2,FALSE),U36)+V36)","v":""},{"$f":"Mainframe!H35","v":0},{"$f":"IF(X36=0,\"\",IF(NOT(ISNA(VLOOKUP(X36,Answers!K:L,2,FALSE))),VLOOKUP(X36,Answers!K:L,2,FALSE),\"Help!\"))","v":""},null,{"$f":"IF(Y36=\"\",\"\",W36+IF(Y36=\"XX\",VLOOKUP(\"WRONG\",Answers!K:L,2,FALSE),Y36)+Z36)","v":""},{"$f":"Mainframe!I35","v":0},{"$f":"IF(AB36=0,\"\",IF(NOT(ISNA(VLOOKUP(AB36,Answers!M:N,2,FALSE))),VLOOKUP(AB36,Answers!M:N,2,FALSE),\"Help!\"))","v":""},null,{"$f":"IF(AC36=\"\",\"\",AA36+IF(AC36=\"XX\",VLOOKUP(\"WRONG\",Answers!M:N,2,FALSE),AC36)+AD36)","v":""},{"$f":"Mainframe!J35","v":0},{"$f":"IF(AF36=0,\"\",IF(NOT(ISNA(VLOOKUP(AF36,Answers!O:P,2,FALSE))),VLOOKUP(AF36,Answers!O:P,2,FALSE),\"Help!\"))","v":""},null,{"$f":"IF(AG36=\"\",\"\",AE36+IF(AG36=\"XX\",VLOOKUP(\"WRONG\",Answers!O:P,2,FALSE),AG36)+AH36)","v":""},{"$f":"Mainframe!K35","v":0},{"$f":"IF(AJ36=0,\"\",IF(NOT(ISNA(VLOOKUP(AJ36,Answers!Q:R,2,FALSE))),VLOOKUP(AJ36,Answers!Q:R,2,FALSE),\"Help!\"))","v":""},null,{"$f":"IF(AK36=\"\",\"\",AI36+IF(AK36=\"XX\",VLOOKUP(\"WRONG\",Answers!Q:R,2,FALSE),AK36)+AL36)","v":""},{"$f":"Mainframe!L35","v":0},{"$f":"IF(AN36=0,\"\",IF(NOT(ISNA(VLOOKUP(AN36,Answers!S:T,2,FALSE))),VLOOKUP(AN36,Answers!S:T,2,FALSE),\"Help!\"))","v":""},null,{"$f":"IF(AO36=\"\",\"\",AM36+IF(AO36=\"XX\",VLOOKUP(\"WRONG\",Answers!S:T,2,FALSE),AO36)+AP36)","v":""},{"$f":"Mainframe!M35","v":0},{"$f":"IF(AR36=0,\"\",IF(NOT(ISNA(VLOOKUP(AR36,Answers!U:V,2,FALSE))),VLOOKUP(AR36,Answers!U:V,2,FALSE),\"Help!\"))","v":""},null,{"$f":"IF(AS36=\"\",\"\",AQ36+IF(AS36=\"XX\",VLOOKUP(\"WRONG\",Answers!U:V,2,FALSE),AS36)+AT36)","v":""},{"$f":"Mainframe!N35","v":0},{"$f":"IF(AV36=0,\"\",IF(NOT(ISNA(VLOOKUP(AV36,Answers!W:X,2,FALSE))),VLOOKUP(AV36,Answers!W:X,2,FALSE),\"Help!\"))","v":""},null,{"$f":"IF(AW36=\"\",\"\",AU36+IF(AW36=\"XX\",VLOOKUP(\"WRONG\",Answers!W:X,2,FALSE),AW36)+AX36)","v":""},{"$f":"Mainframe!O35","v":0},{"$f":"IF(AZ36=0,\"\",IF(NOT(ISNA(VLOOKUP(AZ36,Answers!Y:Z,2,FALSE))),VLOOKUP(AZ36,Answers!Y:Z,2,FALSE),\"Help!\"))","v":""},null,{"$f":"IF(BA36=\"\",\"\",AY36+IF(BA36=\"XX\",VLOOKUP(\"WRONG\",Answers!Y:Z,2,FALSE),BA36)+BB36)","v":""},{"$f":"Mainframe!P35","v":0},{"$f":"IF(BD36=0,\"\",IF(NOT(ISNA(VLOOKUP(BD36,Answers!AA:AB,2,FALSE))),VLOOKUP(BD36,Answers!AA:AB,2,FALSE),\"Help!\"))","v":""},null,{"$f":"IF(BE36=\"\",\"\",BC36+IF(BE36=\"XX\",VLOOKUP(\"WRONG\",Answers!AA:AB,2,FALSE),BE36)+BF36)","v":""},{"$f":"Mainframe!Q35","v":0},{"$f":"IF(BH36=0,\"\",IF(NOT(ISNA(VLOOKUP(BH36,Answers!AC:AD,2,FALSE))),VLOOKUP(BH36,Answers!AC:AD,2,FALSE),\"Help!\"))","v":""},null,{"$f":"IF(BI36=\"\",\"\",BG36+IF(BI36=\"XX\",VLOOKUP(\"WRONG\",Answers!AC:AD,2,FALSE),BI36)+BJ36)","v":""},{"$f":"Mainframe!R35","v":0},{"$f":"IF(BL36=0,\"\",IF(NOT(ISNA(VLOOKUP(BL36,Answers!AE:AF,2,FALSE))),VLOOKUP(BL36,Answers!AE:AF,2,FALSE),\"Help!\"))","v":""},null,{"$f":"IF(BM36=\"\",\"\",BK36+IF(BM36=\"XX\",VLOOKUP(\"WRONG\",Answers!AE:AF,2,FALSE),BM36)+BN36)","v":""},{"$f":"Mainframe!S35","v":0},{"$f":"IF(BP36=0,\"\",IF(NOT(ISNA(VLOOKUP(BP36,Answers!AG:AH,2,FALSE))),VLOOKUP(BP36,Answers!AG:AH,2,FALSE),\"Help!\"))","v":""},null,{"$f":"IF(BQ36=\"\",\"\",BO36+IF(BQ36=\"XX\",VLOOKUP(\"WRONG\",Answers!AG:AH,2,FALSE),BQ36)+BR36)","v":""},{"$f":"Mainframe!T35","v":0},{"$f":"IF(BT36=0,\"\",IF(NOT(ISNA(VLOOKUP(BT36,Answers!AI:AJ,2,FALSE))),VLOOKUP(BT36,Answers!AI:AJ,2,FALSE),\"Help!\"))","v":""},null,{"$f":"IF(BU36=\"\",\"\",BS36+IF(BU36=\"XX\",VLOOKUP(\"WRONG\",Answers!AI:AJ,2,FALSE),BU36)+BV36)","v":""},{"$f":"Mainframe!U35","v":0},{"$f":"IF(BX36=0,\"\",IF(NOT(ISNA(VLOOKUP(BX36,Answers!AK:AL,2,FALSE))),VLOOKUP(BX36,Answers!AK:AL,2,FALSE),\"Help!\"))","v":""},null,{"$f":"IF(BY36=\"\",\"\",BW36+IF(BY36=\"XX\",VLOOKUP(\"WRONG\",Answers!AK:AL,2,FALSE),BY36)+BZ36)","v":""},{"$f":"Mainframe!V35","v":0},{"$f":"IF(CB36=0,\"\",IF(NOT(ISNA(VLOOKUP(CB36,Answers!AM:AN,2,FALSE))),VLOOKUP(CB36,Answers!AM:AN,2,FALSE),\"Help!\"))","v":""},null,{"$f":"IF(CC36=\"\",\"\",CA36+IF(CC36=\"XX\",VLOOKUP(\"WRONG\",Answers!AM:AN,2,FALSE),CC36)+CD36)","v":""},null,null,"","","","",""]
["[*]",{"$f":"Mainframe!B36","v":0},35,{"$f":"Mainframe!C36","v":0},{"$f":"IF(D37=0,\"\",IF(NOT(ISNA(VLOOKUP(D37,Answers!A:B,2,FALSE))),VLOOKUP(D37,Answers!A:B,2,FALSE),\"Help!\"))","v":""},null,{"$f":"IF(E37=\"\",\"\",IF(E37=\"XX\",VLOOKUP(\"WRONG\",Answers!A:B,2,FALSE),E37)+F37)","v":""},{"$f":"Mainframe!D36","v":0},{"$f":"IF(H37=0,\"\",IF(NOT(ISNA(VLOOKUP(H37,Answers!C:D,2,FALSE))),VLOOKUP(H37,Answers!C:D,2,FALSE),\"Help!\"))","v":""},null,{"$f":"IF(I37=\"\",\"\",G37+IF(I37=\"XX\",VLOOKUP(\"WRONG\",Answers!C:D,2,FALSE),I37)+J37)","v":""},{"$f":"Mainframe!E36","v":0},{"$f":"IF(L37=0,\"\",IF(NOT(ISNA(VLOOKUP(L37,Answers!E:F,2,FALSE))),VLOOKUP(L37,Answers!E:F,2,FALSE),\"Help!\"))","v":""},null,{"$f":"IF(M37=\"\",\"\",K37+IF(M37=\"XX\",VLOOKUP(\"WRONG\",Answers!E:F,2,FALSE),M37)+N37)","v":""},{"$f":"Mainframe!F36","v":0},{"$f":"IF(P37=0,\"\",IF(NOT(ISNA(VLOOKUP(P37,Answers!G:H,2,FALSE))),VLOOKUP(P37,Answers!G:H,2,FALSE),\"Help!\"))","v":""},null,{"$f":"IF(Q37=\"\",\"\",O37+IF(Q37=\"XX\",VLOOKUP(\"WRONG\",Answers!G:H,2,FALSE),Q37)+R37)","v":""},{"$f":"Mainframe!G36","v":0},{"$f":"IF(T37=0,\"\",IF(NOT(ISNA(VLOOKUP(T37,Answers!I:J,2,FALSE))),VLOOKUP(T37,Answers!I:J,2,FALSE),\"Help!\"))","v":""},null,{"$f":"IF(U37=\"\",\"\",S37+IF(U37=\"XX\",VLOOKUP(\"WRONG\",Answers!I:J,2,FALSE),U37)+V37)","v":""},{"$f":"Mainframe!H36","v":0},{"$f":"IF(X37=0,\"\",IF(NOT(ISNA(VLOOKUP(X37,Answers!K:L,2,FALSE))),VLOOKUP(X37,Answers!K:L,2,FALSE),\"Help!\"))","v":""},null,{"$f":"IF(Y37=\"\",\"\",W37+IF(Y37=\"XX\",VLOOKUP(\"WRONG\",Answers!K:L,2,FALSE),Y37)+Z37)","v":""},{"$f":"Mainframe!I36","v":0},{"$f":"IF(AB37=0,\"\",IF(NOT(ISNA(VLOOKUP(AB37,Answers!M:N,2,FALSE))),VLOOKUP(AB37,Answers!M:N,2,FALSE),\"Help!\"))","v":""},null,{"$f":"IF(AC37=\"\",\"\",AA37+IF(AC37=\"XX\",VLOOKUP(\"WRONG\",Answers!M:N,2,FALSE),AC37)+AD37)","v":""},{"$f":"Mainframe!J36","v":0},{"$f":"IF(AF37=0,\"\",IF(NOT(ISNA(VLOOKUP(AF37,Answers!O:P,2,FALSE))),VLOOKUP(AF37,Answers!O:P,2,FALSE),\"Help!\"))","v":""},null,{"$f":"IF(AG37=\"\",\"\",AE37+IF(AG37=\"XX\",VLOOKUP(\"WRONG\",Answers!O:P,2,FALSE),AG37)+AH37)","v":""},{"$f":"Mainframe!K36","v":0},{"$f":"IF(AJ37=0,\"\",IF(NOT(ISNA(VLOOKUP(AJ37,Answers!Q:R,2,FALSE))),VLOOKUP(AJ37,Answers!Q:R,2,FALSE),\"Help!\"))","v":""},null,{"$f":"IF(AK37=\"\",\"\",AI37+IF(AK37=\"XX\",VLOOKUP(\"WRONG\",Answers!Q:R,2,FALSE),AK37)+AL37)","v":""},{"$f":"Mainframe!L36","v":0},{"$f":"IF(AN37=0,\"\",IF(NOT(ISNA(VLOOKUP(AN37,Answers!S:T,2,FALSE))),VLOOKUP(AN37,Answers!S:T,2,FALSE),\"Help!\"))","v":""},null,{"$f":"IF(AO37=\"\",\"\",AM37+IF(AO37=\"XX\",VLOOKUP(\"WRONG\",Answers!S:T,2,FALSE),AO37)+AP37)","v":""},{"$f":"Mainframe!M36","v":0},{"$f":"IF(AR37=0,\"\",IF(NOT(ISNA(VLOOKUP(AR37,Answers!U:V,2,FALSE))),VLOOKUP(AR37,Answers!U:V,2,FALSE),\"Help!\"))","v":""},null,{"$f":"IF(AS37=\"\",\"\",AQ37+IF(AS37=\"XX\",VLOOKUP(\"WRONG\",Answers!U:V,2,FALSE),AS37)+AT37)","v":""},{"$f":"Mainframe!N36","v":0},{"$f":"IF(AV37=0,\"\",IF(NOT(ISNA(VLOOKUP(AV37,Answers!W:X,2,FALSE))),VLOOKUP(AV37,Answers!W:X,2,FALSE),\"Help!\"))","v":""},null,{"$f":"IF(AW37=\"\",\"\",AU37+IF(AW37=\"XX\",VLOOKUP(\"WRONG\",Answers!W:X,2,FALSE),AW37)+AX37)","v":""},{"$f":"Mainframe!O36","v":0},{"$f":"IF(AZ37=0,\"\",IF(NOT(ISNA(VLOOKUP(AZ37,Answers!Y:Z,2,FALSE))),VLOOKUP(AZ37,Answers!Y:Z,2,FALSE),\"Help!\"))","v":""},null,{"$f":"IF(BA37=\"\",\"\",AY37+IF(BA37=\"XX\",VLOOKUP(\"WRONG\",Answers!Y:Z,2,FALSE),BA37)+BB37)","v":""},{"$f":"Mainframe!P36","v":0},{"$f":"IF(BD37=0,\"\",IF(NOT(ISNA(VLOOKUP(BD37,Answers!AA:AB,2,FALSE))),VLOOKUP(BD37,Answers!AA:AB,2,FALSE),\"Help!\"))","v":""},null,{"$f":"IF(BE37=\"\",\"\",BC37+IF(BE37=\"XX\",VLOOKUP(\"WRONG\",Answers!AA:AB,2,FALSE),BE37)+BF37)","v":""},{"$f":"Mainframe!Q36","v":0},{"$f":"IF(BH37=0,\"\",IF(NOT(ISNA(VLOOKUP(BH37,Answers!AC:AD,2,FALSE))),VLOOKUP(BH37,Answers!AC:AD,2,FALSE),\"Help!\"))","v":""},null,{"$f":"IF(BI37=\"\",\"\",BG37+IF(BI37=\"XX\",VLOOKUP(\"WRONG\",Answers!AC:AD,2,FALSE),BI37)+BJ37)","v":""},{"$f":"Mainframe!R36","v":0},{"$f":"IF(BL37=0,\"\",IF(NOT(ISNA(VLOOKUP(BL37,Answers!AE:AF,2,FALSE))),VLOOKUP(BL37,Answers!AE:AF,2,FALSE),\"Help!\"))","v":""},null,{"$f":"IF(BM37=\"\",\"\",BK37+IF(BM37=\"XX\",VLOOKUP(\"WRONG\",Answers!AE:AF,2,FALSE),BM37)+BN37)","v":""},{"$f":"Mainframe!S36","v":0},{"$f":"IF(BP37=0,\"\",IF(NOT(ISNA(VLOOKUP(BP37,Answers!AG:AH,2,FALSE))),VLOOKUP(BP37,Answers!AG:AH,2,FALSE),\"Help!\"))","v":""},null,{"$f":"IF(BQ37=\"\",\"\",BO37+IF(BQ37=\"XX\",VLOOKUP(\"WRONG\",Answers!AG:AH,2,FALSE),BQ37)+BR37)","v":""},{"$f":"Mainframe!T36","v":0},{"$f":"IF(BT37=0,\"\",IF(NOT(ISNA(VLOOKUP(BT37,Answers!AI:AJ,2,FALSE))),VLOOKUP(BT37,Answers!AI:AJ,2,FALSE),\"Help!\"))","v":""},null,{"$f":"IF(BU37=\"\",\"\",BS37+IF(BU37=\"XX\",VLOOKUP(\"WRONG\",Answers!AI:AJ,2,FALSE),BU37)+BV37)","v":""},{"$f":"Mainframe!U36","v":0},{"$f":"IF(BX37=0,\"\",IF(NOT(ISNA(VLOOKUP(BX37,Answers!AK:AL,2,FALSE))),VLOOKUP(BX37,Answers!AK:AL,2,FALSE),\"Help!\"))","v":""},null,{"$f":"IF(BY37=\"\",\"\",BW37+IF(BY37=\"XX\",VLOOKUP(\"WRONG\",Answers!AK:AL,2,FALSE),BY37)+BZ37)","v":""},{"$f":"Mainframe!V36","v":0},{"$f":"IF(CB37=0,\"\",IF(NOT(ISNA(VLOOKUP(CB37,Answers!AM:AN,2,FALSE))),VLOOKUP(CB37,Answers!AM:AN,2,FALSE),\"Help!\"))","v":""},null,{"$f":"IF(CC37=\"\",\"\",CA37+IF(CC37=\"XX\",VLOOKUP(\"WRONG\",Answers!AM:AN,2,FALSE),CC37)+CD37)","v":""},null,null,"","","","",""]
["[*]",{"$f":"Mainframe!B37","v":0},36,{"$f":"Mainframe!C37","v":0},{"$f":"IF(D38=0,\"\",IF(NOT(ISNA(VLOOKUP(D38,Answers!A:B,2,FALSE))),VLOOKUP(D38,Answers!A:B,2,FALSE),\"Help!\"))","v":""},null,{"$f":"IF(E38=\"\",\"\",IF(E38=\"XX\",VLOOKUP(\"WRONG\",Answers!A:B,2,FALSE),E38)+F38)","v":""},{"$f":"Mainframe!D37","v":0},{"$f":"IF(H38=0,\"\",IF(NOT(ISNA(VLOOKUP(H38,Answers!C:D,2,FALSE))),VLOOKUP(H38,Answers!C:D,2,FALSE),\"Help!\"))","v":""},null,{"$f":"IF(I38=\"\",\"\",G38+IF(I38=\"XX\",VLOOKUP(\"WRONG\",Answers!C:D,2,FALSE),I38)+J38)","v":""},{"$f":"Mainframe!E37","v":0},{"$f":"IF(L38=0,\"\",IF(NOT(ISNA(VLOOKUP(L38,Answers!E:F,2,FALSE))),VLOOKUP(L38,Answers!E:F,2,FALSE),\"Help!\"))","v":""},null,{"$f":"IF(M38=\"\",\"\",K38+IF(M38=\"XX\",VLOOKUP(\"WRONG\",Answers!E:F,2,FALSE),M38)+N38)","v":""},{"$f":"Mainframe!F37","v":0},{"$f":"IF(P38=0,\"\",IF(NOT(ISNA(VLOOKUP(P38,Answers!G:H,2,FALSE))),VLOOKUP(P38,Answers!G:H,2,FALSE),\"Help!\"))","v":""},null,{"$f":"IF(Q38=\"\",\"\",O38+IF(Q38=\"XX\",VLOOKUP(\"WRONG\",Answers!G:H,2,FALSE),Q38)+R38)","v":""},{"$f":"Mainframe!G37","v":0},{"$f":"IF(T38=0,\"\",IF(NOT(ISNA(VLOOKUP(T38,Answers!I:J,2,FALSE))),VLOOKUP(T38,Answers!I:J,2,FALSE),\"Help!\"))","v":""},null,{"$f":"IF(U38=\"\",\"\",S38+IF(U38=\"XX\",VLOOKUP(\"WRONG\",Answers!I:J,2,FALSE),U38)+V38)","v":""},{"$f":"Mainframe!H37","v":0},{"$f":"IF(X38=0,\"\",IF(NOT(ISNA(VLOOKUP(X38,Answers!K:L,2,FALSE))),VLOOKUP(X38,Answers!K:L,2,FALSE),\"Help!\"))","v":""},null,{"$f":"IF(Y38=\"\",\"\",W38+IF(Y38=\"XX\",VLOOKUP(\"WRONG\",Answers!K:L,2,FALSE),Y38)+Z38)","v":""},{"$f":"Mainframe!I37","v":0},{"$f":"IF(AB38=0,\"\",IF(NOT(ISNA(VLOOKUP(AB38,Answers!M:N,2,FALSE))),VLOOKUP(AB38,Answers!M:N,2,FALSE),\"Help!\"))","v":""},null,{"$f":"IF(AC38=\"\",\"\",AA38+IF(AC38=\"XX\",VLOOKUP(\"WRONG\",Answers!M:N,2,FALSE),AC38)+AD38)","v":""},{"$f":"Mainframe!J37","v":0},{"$f":"IF(AF38=0,\"\",IF(NOT(ISNA(VLOOKUP(AF38,Answers!O:P,2,FALSE))),VLOOKUP(AF38,Answers!O:P,2,FALSE),\"Help!\"))","v":""},null,{"$f":"IF(AG38=\"\",\"\",AE38+IF(AG38=\"XX\",VLOOKUP(\"WRONG\",Answers!O:P,2,FALSE),AG38)+AH38)","v":""},{"$f":"Mainframe!K37","v":0},{"$f":"IF(AJ38=0,\"\",IF(NOT(ISNA(VLOOKUP(AJ38,Answers!Q:R,2,FALSE))),VLOOKUP(AJ38,Answers!Q:R,2,FALSE),\"Help!\"))","v":""},null,{"$f":"IF(AK38=\"\",\"\",AI38+IF(AK38=\"XX\",VLOOKUP(\"WRONG\",Answers!Q:R,2,FALSE),AK38)+AL38)","v":""},{"$f":"Mainframe!L37","v":0},{"$f":"IF(AN38=0,\"\",IF(NOT(ISNA(VLOOKUP(AN38,Answers!S:T,2,FALSE))),VLOOKUP(AN38,Answers!S:T,2,FALSE),\"Help!\"))","v":""},null,{"$f":"IF(AO38=\"\",\"\",AM38+IF(AO38=\"XX\",VLOOKUP(\"WRONG\",Answers!S:T,2,FALSE),AO38)+AP38)","v":""},{"$f":"Mainframe!M37","v":0},{"$f":"IF(AR38=0,\"\",IF(NOT(ISNA(VLOOKUP(AR38,Answers!U:V,2,FALSE))),VLOOKUP(AR38,Answers!U:V,2,FALSE),\"Help!\"))","v":""},null,{"$f":"IF(AS38=\"\",\"\",AQ38+IF(AS38=\"XX\",VLOOKUP(\"WRONG\",Answers!U:V,2,FALSE),AS38)+AT38)","v":""},{"$f":"Mainframe!N37","v":0},{"$f":"IF(AV38=0,\"\",IF(NOT(ISNA(VLOOKUP(AV38,Answers!W:X,2,FALSE))),VLOOKUP(AV38,Answers!W:X,2,FALSE),\"Help!\"))","v":""},null,{"$f":"IF(AW38=\"\",\"\",AU38+IF(AW38=\"XX\",VLOOKUP(\"WRONG\",Answers!W:X,2,FALSE),AW38)+AX38)","v":""},{"$f":"Mainframe!O37","v":0},{"$f":"IF(AZ38=0,\"\",IF(NOT(ISNA(VLOOKUP(AZ38,Answers!Y:Z,2,FALSE))),VLOOKUP(AZ38,Answers!Y:Z,2,FALSE),\"Help!\"))","v":""},null,{"$f":"IF(BA38=\"\",\"\",AY38+IF(BA38=\"XX\",VLOOKUP(\"WRONG\",Answers!Y:Z,2,FALSE),BA38)+BB38)","v":""},{"$f":"Mainframe!P37","v":0},{"$f":"IF(BD38=0,\"\",IF(NOT(ISNA(VLOOKUP(BD38,Answers!AA:AB,2,FALSE))),VLOOKUP(BD38,Answers!AA:AB,2,FALSE),\"Help!\"))","v":""},null,{"$f":"IF(BE38=\"\",\"\",BC38+IF(BE38=\"XX\",VLOOKUP(\"WRONG\",Answers!AA:AB,2,FALSE),BE38)+BF38)","v":""},{"$f":"Mainframe!Q37","v":0},{"$f":"IF(BH38=0,\"\",IF(NOT(ISNA(VLOOKUP(BH38,Answers!AC:AD,2,FALSE))),VLOOKUP(BH38,Answers!AC:AD,2,FALSE),\"Help!\"))","v":""},null,{"$f":"IF(BI38=\"\",\"\",BG38+IF(BI38=\"XX\",VLOOKUP(\"WRONG\",Answers!AC:AD,2,FALSE),BI38)+BJ38)","v":""},{"$f":"Mainframe!R37","v":0},{"$f":"IF(BL38=0,\"\",IF(NOT(ISNA(VLOOKUP(BL38,Answers!AE:AF,2,FALSE))),VLOOKUP(BL38,Answers!AE:AF,2,FALSE),\"Help!\"))","v":""},null,{"$f":"IF(BM38=\"\",\"\",BK38+IF(BM38=\"XX\",VLOOKUP(\"WRONG\",Answers!AE:AF,2,FALSE),BM38)+BN38)","v":""},{"$f":"Mainframe!S37","v":0},{"$f":"IF(BP38=0,\"\",IF(NOT(ISNA(VLOOKUP(BP38,Answers!AG:AH,2,FALSE))),VLOOKUP(BP38,Answers!AG:AH,2,FALSE),\"Help!\"))","v":""},null,{"$f":"IF(BQ38=\"\",\"\",BO38+IF(BQ38=\"XX\",VLOOKUP(\"WRONG\",Answers!AG:AH,2,FALSE),BQ38)+BR38)","v":""},{"$f":"Mainframe!T37","v":0},{"$f":"IF(BT38=0,\"\",IF(NOT(ISNA(VLOOKUP(BT38,Answers!AI:AJ,2,FALSE))),VLOOKUP(BT38,Answers!AI:AJ,2,FALSE),\"Help!\"))","v":""},null,{"$f":"IF(BU38=\"\",\"\",BS38+IF(BU38=\"XX\",VLOOKUP(\"WRONG\",Answers!AI:AJ,2,FALSE),BU38)+BV38)","v":""},{"$f":"Mainframe!U37","v":0},{"$f":"IF(BX38=0,\"\",IF(NOT(ISNA(VLOOKUP(BX38,Answers!AK:AL,2,FALSE))),VLOOKUP(BX38,Answers!AK:AL,2,FALSE),\"Help!\"))","v":""},null,{"$f":"IF(BY38=\"\",\"\",BW38+IF(BY38=\"XX\",VLOOKUP(\"WRONG\",Answers!AK:AL,2,FALSE),BY38)+BZ38)","v":""},{"$f":"Mainframe!V37","v":0},{"$f":"IF(CB38=0,\"\",IF(NOT(ISNA(VLOOKUP(CB38,Answers!AM:AN,2,FALSE))),VLOOKUP(CB38,Answers!AM:AN,2,FALSE),\"Help!\"))","v":""},null,{"$f":"IF(CC38=\"\",\"\",CA38+IF(CC38=\"XX\",VLOOKUP(\"WRONG\",Answers!AM:AN,2,FALSE),CC38)+CD38)","v":""},null,null,"","","","",""]
["[*]",{"$f":"Mainframe!B38","v":0},37,{"$f":"Mainframe!C38","v":0},{"$f":"IF(D39=0,\"\",IF(NOT(ISNA(VLOOKUP(D39,Answers!A:B,2,FALSE))),VLOOKUP(D39,Answers!A:B,2,FALSE),\"Help!\"))","v":""},null,{"$f":"IF(E39=\"\",\"\",IF(E39=\"XX\",VLOOKUP(\"WRONG\",Answers!A:B,2,FALSE),E39)+F39)","v":""},{"$f":"Mainframe!D38","v":0},{"$f":"IF(H39=0,\"\",IF(NOT(ISNA(VLOOKUP(H39,Answers!C:D,2,FALSE))),VLOOKUP(H39,Answers!C:D,2,FALSE),\"Help!\"))","v":""},null,{"$f":"IF(I39=\"\",\"\",G39+IF(I39=\"XX\",VLOOKUP(\"WRONG\",Answers!C:D,2,FALSE),I39)+J39)","v":""},{"$f":"Mainframe!E38","v":0},{"$f":"IF(L39=0,\"\",IF(NOT(ISNA(VLOOKUP(L39,Answers!E:F,2,FALSE))),VLOOKUP(L39,Answers!E:F,2,FALSE),\"Help!\"))","v":""},null,{"$f":"IF(M39=\"\",\"\",K39+IF(M39=\"XX\",VLOOKUP(\"WRONG\",Answers!E:F,2,FALSE),M39)+N39)","v":""},{"$f":"Mainframe!F38","v":0},{"$f":"IF(P39=0,\"\",IF(NOT(ISNA(VLOOKUP(P39,Answers!G:H,2,FALSE))),VLOOKUP(P39,Answers!G:H,2,FALSE),\"Help!\"))","v":""},null,{"$f":"IF(Q39=\"\",\"\",O39+IF(Q39=\"XX\",VLOOKUP(\"WRONG\",Answers!G:H,2,FALSE),Q39)+R39)","v":""},{"$f":"Mainframe!G38","v":0},{"$f":"IF(T39=0,\"\",IF(NOT(ISNA(VLOOKUP(T39,Answers!I:J,2,FALSE))),VLOOKUP(T39,Answers!I:J,2,FALSE),\"Help!\"))","v":""},null,{"$f":"IF(U39=\"\",\"\",S39+IF(U39=\"XX\",VLOOKUP(\"WRONG\",Answers!I:J,2,FALSE),U39)+V39)","v":""},{"$f":"Mainframe!H38","v":0},{"$f":"IF(X39=0,\"\",IF(NOT(ISNA(VLOOKUP(X39,Answers!K:L,2,FALSE))),VLOOKUP(X39,Answers!K:L,2,FALSE),\"Help!\"))","v":""},null,{"$f":"IF(Y39=\"\",\"\",W39+IF(Y39=\"XX\",VLOOKUP(\"WRONG\",Answers!K:L,2,FALSE),Y39)+Z39)","v":""},{"$f":"Mainframe!I38","v":0},{"$f":"IF(AB39=0,\"\",IF(NOT(ISNA(VLOOKUP(AB39,Answers!M:N,2,FALSE))),VLOOKUP(AB39,Answers!M:N,2,FALSE),\"Help!\"))","v":""},null,{"$f":"IF(AC39=\"\",\"\",AA39+IF(AC39=\"XX\",VLOOKUP(\"WRONG\",Answers!M:N,2,FALSE),AC39)+AD39)","v":""},{"$f":"Mainframe!J38","v":0},{"$f":"IF(AF39=0,\"\",IF(NOT(ISNA(VLOOKUP(AF39,Answers!O:P,2,FALSE))),VLOOKUP(AF39,Answers!O:P,2,FALSE),\"Help!\"))","v":""},null,{"$f":"IF(AG39=\"\",\"\",AE39+IF(AG39=\"XX\",VLOOKUP(\"WRONG\",Answers!O:P,2,FALSE),AG39)+AH39)","v":""},{"$f":"Mainframe!K38","v":0},{"$f":"IF(AJ39=0,\"\",IF(NOT(ISNA(VLOOKUP(AJ39,Answers!Q:R,2,FALSE))),VLOOKUP(AJ39,Answers!Q:R,2,FALSE),\"Help!\"))","v":""},null,{"$f":"IF(AK39=\"\",\"\",AI39+IF(AK39=\"XX\",VLOOKUP(\"WRONG\",Answers!Q:R,2,FALSE),AK39)+AL39)","v":""},{"$f":"Mainframe!L38","v":0},{"$f":"IF(AN39=0,\"\",IF(NOT(ISNA(VLOOKUP(AN39,Answers!S:T,2,FALSE))),VLOOKUP(AN39,Answers!S:T,2,FALSE),\"Help!\"))","v":""},null,{"$f":"IF(AO39=\"\",\"\",AM39+IF(AO39=\"XX\",VLOOKUP(\"WRONG\",Answers!S:T,2,FALSE),AO39)+AP39)","v":""},{"$f":"Mainframe!M38","v":0},{"$f":"IF(AR39=0,\"\",IF(NOT(ISNA(VLOOKUP(AR39,Answers!U:V,2,FALSE))),VLOOKUP(AR39,Answers!U:V,2,FALSE),\"Help!\"))","v":""},null,{"$f":"IF(AS39=\"\",\"\",AQ39+IF(AS39=\"XX\",VLOOKUP(\"WRONG\",Answers!U:V,2,FALSE),AS39)+AT39)","v":""},{"$f":"Mainframe!N38","v":0},{"$f":"IF(AV39=0,\"\",IF(NOT(ISNA(VLOOKUP(AV39,Answers!W:X,2,FALSE))),VLOOKUP(AV39,Answers!W:X,2,FALSE),\"Help!\"))","v":""},null,{"$f":"IF(AW39=\"\",\"\",AU39+IF(AW39=\"XX\",VLOOKUP(\"WRONG\",Answers!W:X,2,FALSE),AW39)+AX39)","v":""},{"$f":"Mainframe!O38","v":0},{"$f":"IF(AZ39=0,\"\",IF(NOT(ISNA(VLOOKUP(AZ39,Answers!Y:Z,2,FALSE))),VLOOKUP(AZ39,Answers!Y:Z,2,FALSE),\"Help!\"))","v":""},null,{"$f":"IF(BA39=\"\",\"\",AY39+IF(BA39=\"XX\",VLOOKUP(\"WRONG\",Answers!Y:Z,2,FALSE),BA39)+BB39)","v":""},{"$f":"Mainframe!P38","v":0},{"$f":"IF(BD39=0,\"\",IF(NOT(ISNA(VLOOKUP(BD39,Answers!AA:AB,2,FALSE))),VLOOKUP(BD39,Answers!AA:AB,2,FALSE),\"Help!\"))","v":""},null,{"$f":"IF(BE39=\"\",\"\",BC39+IF(BE39=\"XX\",VLOOKUP(\"WRONG\",Answers!AA:AB,2,FALSE),BE39)+BF39)","v":""},{"$f":"Mainframe!Q38","v":0},{"$f":"IF(BH39=0,\"\",IF(NOT(ISNA(VLOOKUP(BH39,Answers!AC:AD,2,FALSE))),VLOOKUP(BH39,Answers!AC:AD,2,FALSE),\"Help!\"))","v":""},null,{"$f":"IF(BI39=\"\",\"\",BG39+IF(BI39=\"XX\",VLOOKUP(\"WRONG\",Answers!AC:AD,2,FALSE),BI39)+BJ39)","v":""},{"$f":"Mainframe!R38","v":0},{"$f":"IF(BL39=0,\"\",IF(NOT(ISNA(VLOOKUP(BL39,Answers!AE:AF,2,FALSE))),VLOOKUP(BL39,Answers!AE:AF,2,FALSE),\"Help!\"))","v":""},null,{"$f":"IF(BM39=\"\",\"\",BK39+IF(BM39=\"XX\",VLOOKUP(\"WRONG\",Answers!AE:AF,2,FALSE),BM39)+BN39)","v":""},{"$f":"Mainframe!S38","v":0},{"$f":"IF(BP39=0,\"\",IF(NOT(ISNA(VLOOKUP(BP39,Answers!AG:AH,2,FALSE))),VLOOKUP(BP39,Answers!AG:AH,2,FALSE),\"Help!\"))","v":""},null,{"$f":"IF(BQ39=\"\",\"\",BO39+IF(BQ39=\"XX\",VLOOKUP(\"WRONG\",Answers!AG:AH,2,FALSE),BQ39)+BR39)","v":""},{"$f":"Mainframe!T38","v":0},{"$f":"IF(BT39=0,\"\",IF(NOT(ISNA(VLOOKUP(BT39,Answers!AI:AJ,2,FALSE))),VLOOKUP(BT39,Answers!AI:AJ,2,FALSE),\"Help!\"))","v":""},null,{"$f":"IF(BU39=\"\",\"\",BS39+IF(BU39=\"XX\",VLOOKUP(\"WRONG\",Answers!AI:AJ,2,FALSE),BU39)+BV39)","v":""},{"$f":"Mainframe!U38","v":0},{"$f":"IF(BX39=0,\"\",IF(NOT(ISNA(VLOOKUP(BX39,Answers!AK:AL,2,FALSE))),VLOOKUP(BX39,Answers!AK:AL,2,FALSE),\"Help!\"))","v":""},null,{"$f":"IF(BY39=\"\",\"\",BW39+IF(BY39=\"XX\",VLOOKUP(\"WRONG\",Answers!AK:AL,2,FALSE),BY39)+BZ39)","v":""},{"$f":"Mainframe!V38","v":0},{"$f":"IF(CB39=0,\"\",IF(NOT(ISNA(VLOOKUP(CB39,Answers!AM:AN,2,FALSE))),VLOOKUP(CB39,Answers!AM:AN,2,FALSE),\"Help!\"))","v":""},null,{"$f":"IF(CC39=\"\",\"\",CA39+IF(CC39=\"XX\",VLOOKUP(\"WRONG\",Answers!AM:AN,2,FALSE),CC39)+CD39)","v":""},null,null,"","","","",""]
["[*]",{"$f":"Mainframe!B39","v":0},38,{"$f":"Mainframe!C39","v":0},{"$f":"IF(D40=0,\"\",IF(NOT(ISNA(VLOOKUP(D40,Answers!A:B,2,FALSE))),VLOOKUP(D40,Answers!A:B,2,FALSE),\"Help!\"))","v":""},null,{"$f":"IF(E40=\"\",\"\",IF(E40=\"XX\",VLOOKUP(\"WRONG\",Answers!A:B,2,FALSE),E40)+F40)","v":""},{"$f":"Mainframe!D39","v":0},{"$f":"IF(H40=0,\"\",IF(NOT(ISNA(VLOOKUP(H40,Answers!C:D,2,FALSE))),VLOOKUP(H40,Answers!C:D,2,FALSE),\"Help!\"))","v":""},null,{"$f":"IF(I40=\"\",\"\",G40+IF(I40=\"XX\",VLOOKUP(\"WRONG\",Answers!C:D,2,FALSE),I40)+J40)","v":""},{"$f":"Mainframe!E39","v":0},{"$f":"IF(L40=0,\"\",IF(NOT(ISNA(VLOOKUP(L40,Answers!E:F,2,FALSE))),VLOOKUP(L40,Answers!E:F,2,FALSE),\"Help!\"))","v":""},null,{"$f":"IF(M40=\"\",\"\",K40+IF(M40=\"XX\",VLOOKUP(\"WRONG\",Answers!E:F,2,FALSE),M40)+N40)","v":""},{"$f":"Mainframe!F39","v":0},{"$f":"IF(P40=0,\"\",IF(NOT(ISNA(VLOOKUP(P40,Answers!G:H,2,FALSE))),VLOOKUP(P40,Answers!G:H,2,FALSE),\"Help!\"))","v":""},null,{"$f":"IF(Q40=\"\",\"\",O40+IF(Q40=\"XX\",VLOOKUP(\"WRONG\",Answers!G:H,2,FALSE),Q40)+R40)","v":""},{"$f":"Mainframe!G39","v":0},{"$f":"IF(T40=0,\"\",IF(NOT(ISNA(VLOOKUP(T40,Answers!I:J,2,FALSE))),VLOOKUP(T40,Answers!I:J,2,FALSE),\"Help!\"))","v":""},null,{"$f":"IF(U40=\"\",\"\",S40+IF(U40=\"XX\",VLOOKUP(\"WRONG\",Answers!I:J,2,FALSE),U40)+V40)","v":""},{"$f":"Mainframe!H39","v":0},{"$f":"IF(X40=0,\"\",IF(NOT(ISNA(VLOOKUP(X40,Answers!K:L,2,FALSE))),VLOOKUP(X40,Answers!K:L,2,FALSE),\"Help!\"))","v":""},null,{"$f":"IF(Y40=\"\",\"\",W40+IF(Y40=\"XX\",VLOOKUP(\"WRONG\",Answers!K:L,2,FALSE),Y40)+Z40)","v":""},{"$f":"Mainframe!I39","v":0},{"$f":"IF(AB40=0,\"\",IF(NOT(ISNA(VLOOKUP(AB40,Answers!M:N,2,FALSE))),VLOOKUP(AB40,Answers!M:N,2,FALSE),\"Help!\"))","v":""},null,{"$f":"IF(AC40=\"\",\"\",AA40+IF(AC40=\"XX\",VLOOKUP(\"WRONG\",Answers!M:N,2,FALSE),AC40)+AD40)","v":""},{"$f":"Mainframe!J39","v":0},{"$f":"IF(AF40=0,\"\",IF(NOT(ISNA(VLOOKUP(AF40,Answers!O:P,2,FALSE))),VLOOKUP(AF40,Answers!O:P,2,FALSE),\"Help!\"))","v":""},null,{"$f":"IF(AG40=\"\",\"\",AE40+IF(AG40=\"XX\",VLOOKUP(\"WRONG\",Answers!O:P,2,FALSE),AG40)+AH40)","v":""},{"$f":"Mainframe!K39","v":0},{"$f":"IF(AJ40=0,\"\",IF(NOT(ISNA(VLOOKUP(AJ40,Answers!Q:R,2,FALSE))),VLOOKUP(AJ40,Answers!Q:R,2,FALSE),\"Help!\"))","v":""},null,{"$f":"IF(AK40=\"\",\"\",AI40+IF(AK40=\"XX\",VLOOKUP(\"WRONG\",Answers!Q:R,2,FALSE),AK40)+AL40)","v":""},{"$f":"Mainframe!L39","v":0},{"$f":"IF(AN40=0,\"\",IF(NOT(ISNA(VLOOKUP(AN40,Answers!S:T,2,FALSE))),VLOOKUP(AN40,Answers!S:T,2,FALSE),\"Help!\"))","v":""},null,{"$f":"IF(AO40=\"\",\"\",AM40+IF(AO40=\"XX\",VLOOKUP(\"WRONG\",Answers!S:T,2,FALSE),AO40)+AP40)","v":""},{"$f":"Mainframe!M39","v":0},{"$f":"IF(AR40=0,\"\",IF(NOT(ISNA(VLOOKUP(AR40,Answers!U:V,2,FALSE))),VLOOKUP(AR40,Answers!U:V,2,FALSE),\"Help!\"))","v":""},null,{"$f":"IF(AS40=\"\",\"\",AQ40+IF(AS40=\"XX\",VLOOKUP(\"WRONG\",Answers!U:V,2,FALSE),AS40)+AT40)","v":""},{"$f":"Mainframe!N39","v":0},{"$f":"IF(AV40=0,\"\",IF(NOT(ISNA(VLOOKUP(AV40,Answers!W:X,2,FALSE))),VLOOKUP(AV40,Answers!W:X,2,FALSE),\"Help!\"))","v":""},null,{"$f":"IF(AW40=\"\",\"\",AU40+IF(AW40=\"XX\",VLOOKUP(\"WRONG\",Answers!W:X,2,FALSE),AW40)+AX40)","v":""},{"$f":"Mainframe!O39","v":0},{"$f":"IF(AZ40=0,\"\",IF(NOT(ISNA(VLOOKUP(AZ40,Answers!Y:Z,2,FALSE))),VLOOKUP(AZ40,Answers!Y:Z,2,FALSE),\"Help!\"))","v":""},null,{"$f":"IF(BA40=\"\",\"\",AY40+IF(BA40=\"XX\",VLOOKUP(\"WRONG\",Answers!Y:Z,2,FALSE),BA40)+BB40)","v":""},{"$f":"Mainframe!P39","v":0},{"$f":"IF(BD40=0,\"\",IF(NOT(ISNA(VLOOKUP(BD40,Answers!AA:AB,2,FALSE))),VLOOKUP(BD40,Answers!AA:AB,2,FALSE),\"Help!\"))","v":""},null,{"$f":"IF(BE40=\"\",\"\",BC40+IF(BE40=\"XX\",VLOOKUP(\"WRONG\",Answers!AA:AB,2,FALSE),BE40)+BF40)","v":""},{"$f":"Mainframe!Q39","v":0},{"$f":"IF(BH40=0,\"\",IF(NOT(ISNA(VLOOKUP(BH40,Answers!AC:AD,2,FALSE))),VLOOKUP(BH40,Answers!AC:AD,2,FALSE),\"Help!\"))","v":""},null,{"$f":"IF(BI40=\"\",\"\",BG40+IF(BI40=\"XX\",VLOOKUP(\"WRONG\",Answers!AC:AD,2,FALSE),BI40)+BJ40)","v":""},{"$f":"Mainframe!R39","v":0},{"$f":"IF(BL40=0,\"\",IF(NOT(ISNA(VLOOKUP(BL40,Answers!AE:AF,2,FALSE))),VLOOKUP(BL40,Answers!AE:AF,2,FALSE),\"Help!\"))","v":""},null,{"$f":"IF(BM40=\"\",\"\",BK40+IF(BM40=\"XX\",VLOOKUP(\"WRONG\",Answers!AE:AF,2,FALSE),BM40)+BN40)","v":""},{"$f":"Mainframe!S39","v":0},{"$f":"IF(BP40=0,\"\",IF(NOT(ISNA(VLOOKUP(BP40,Answers!AG:AH,2,FALSE))),VLOOKUP(BP40,Answers!AG:AH,2,FALSE),\"Help!\"))","v":""},null,{"$f":"IF(BQ40=\"\",\"\",BO40+IF(BQ40=\"XX\",VLOOKUP(\"WRONG\",Answers!AG:AH,2,FALSE),BQ40)+BR40)","v":""},{"$f":"Mainframe!T39","v":0},{"$f":"IF(BT40=0,\"\",IF(NOT(ISNA(VLOOKUP(BT40,Answers!AI:AJ,2,FALSE))),VLOOKUP(BT40,Answers!AI:AJ,2,FALSE),\"Help!\"))","v":""},null,{"$f":"IF(BU40=\"\",\"\",BS40+IF(BU40=\"XX\",VLOOKUP(\"WRONG\",Answers!AI:AJ,2,FALSE),BU40)+BV40)","v":""},{"$f":"Mainframe!U39","v":0},{"$f":"IF(BX40=0,\"\",IF(NOT(ISNA(VLOOKUP(BX40,Answers!AK:AL,2,FALSE))),VLOOKUP(BX40,Answers!AK:AL,2,FALSE),\"Help!\"))","v":""},null,{"$f":"IF(BY40=\"\",\"\",BW40+IF(BY40=\"XX\",VLOOKUP(\"WRONG\",Answers!AK:AL,2,FALSE),BY40)+BZ40)","v":""},{"$f":"Mainframe!V39","v":0},{"$f":"IF(CB40=0,\"\",IF(NOT(ISNA(VLOOKUP(CB40,Answers!AM:AN,2,FALSE))),VLOOKUP(CB40,Answers!AM:AN,2,FALSE),\"Help!\"))","v":""},null,{"$f":"IF(CC40=\"\",\"\",CA40+IF(CC40=\"XX\",VLOOKUP(\"WRONG\",Answers!AM:AN,2,FALSE),CC40)+CD40)","v":""},null,null,"","","","",""]
["[*]",{"$f":"Mainframe!B40","v":0},39,{"$f":"Mainframe!C40","v":0},{"$f":"IF(D41=0,\"\",IF(NOT(ISNA(VLOOKUP(D41,Answers!A:B,2,FALSE))),VLOOKUP(D41,Answers!A:B,2,FALSE),\"Help!\"))","v":""},null,{"$f":"IF(E41=\"\",\"\",IF(E41=\"XX\",VLOOKUP(\"WRONG\",Answers!A:B,2,FALSE),E41)+F41)","v":""},{"$f":"Mainframe!D40","v":0},{"$f":"IF(H41=0,\"\",IF(NOT(ISNA(VLOOKUP(H41,Answers!C:D,2,FALSE))),VLOOKUP(H41,Answers!C:D,2,FALSE),\"Help!\"))","v":""},null,{"$f":"IF(I41=\"\",\"\",G41+IF(I41=\"XX\",VLOOKUP(\"WRONG\",Answers!C:D,2,FALSE),I41)+J41)","v":""},{"$f":"Mainframe!E40","v":0},{"$f":"IF(L41=0,\"\",IF(NOT(ISNA(VLOOKUP(L41,Answers!E:F,2,FALSE))),VLOOKUP(L41,Answers!E:F,2,FALSE),\"Help!\"))","v":""},null,{"$f":"IF(M41=\"\",\"\",K41+IF(M41=\"XX\",VLOOKUP(\"WRONG\",Answers!E:F,2,FALSE),M41)+N41)","v":""},{"$f":"Mainframe!F40","v":0},{"$f":"IF(P41=0,\"\",IF(NOT(ISNA(VLOOKUP(P41,Answers!G:H,2,FALSE))),VLOOKUP(P41,Answers!G:H,2,FALSE),\"Help!\"))","v":""},null,{"$f":"IF(Q41=\"\",\"\",O41+IF(Q41=\"XX\",VLOOKUP(\"WRONG\",Answers!G:H,2,FALSE),Q41)+R41)","v":""},{"$f":"Mainframe!G40","v":0},{"$f":"IF(T41=0,\"\",IF(NOT(ISNA(VLOOKUP(T41,Answers!I:J,2,FALSE))),VLOOKUP(T41,Answers!I:J,2,FALSE),\"Help!\"))","v":""},null,{"$f":"IF(U41=\"\",\"\",S41+IF(U41=\"XX\",VLOOKUP(\"WRONG\",Answers!I:J,2,FALSE),U41)+V41)","v":""},{"$f":"Mainframe!H40","v":0},{"$f":"IF(X41=0,\"\",IF(NOT(ISNA(VLOOKUP(X41,Answers!K:L,2,FALSE))),VLOOKUP(X41,Answers!K:L,2,FALSE),\"Help!\"))","v":""},null,{"$f":"IF(Y41=\"\",\"\",W41+IF(Y41=\"XX\",VLOOKUP(\"WRONG\",Answers!K:L,2,FALSE),Y41)+Z41)","v":""},{"$f":"Mainframe!I40","v":0},{"$f":"IF(AB41=0,\"\",IF(NOT(ISNA(VLOOKUP(AB41,Answers!M:N,2,FALSE))),VLOOKUP(AB41,Answers!M:N,2,FALSE),\"Help!\"))","v":""},null,{"$f":"IF(AC41=\"\",\"\",AA41+IF(AC41=\"XX\",VLOOKUP(\"WRONG\",Answers!M:N,2,FALSE),AC41)+AD41)","v":""},{"$f":"Mainframe!J40","v":0},{"$f":"IF(AF41=0,\"\",IF(NOT(ISNA(VLOOKUP(AF41,Answers!O:P,2,FALSE))),VLOOKUP(AF41,Answers!O:P,2,FALSE),\"Help!\"))","v":""},null,{"$f":"IF(AG41=\"\",\"\",AE41+IF(AG41=\"XX\",VLOOKUP(\"WRONG\",Answers!O:P,2,FALSE),AG41)+AH41)","v":""},{"$f":"Mainframe!K40","v":0},{"$f":"IF(AJ41=0,\"\",IF(NOT(ISNA(VLOOKUP(AJ41,Answers!Q:R,2,FALSE))),VLOOKUP(AJ41,Answers!Q:R,2,FALSE),\"Help!\"))","v":""},null,{"$f":"IF(AK41=\"\",\"\",AI41+IF(AK41=\"XX\",VLOOKUP(\"WRONG\",Answers!Q:R,2,FALSE),AK41)+AL41)","v":""},{"$f":"Mainframe!L40","v":0},{"$f":"IF(AN41=0,\"\",IF(NOT(ISNA(VLOOKUP(AN41,Answers!S:T,2,FALSE))),VLOOKUP(AN41,Answers!S:T,2,FALSE),\"Help!\"))","v":""},null,{"$f":"IF(AO41=\"\",\"\",AM41+IF(AO41=\"XX\",VLOOKUP(\"WRONG\",Answers!S:T,2,FALSE),AO41)+AP41)","v":""},{"$f":"Mainframe!M40","v":0},{"$f":"IF(AR41=0,\"\",IF(NOT(ISNA(VLOOKUP(AR41,Answers!U:V,2,FALSE))),VLOOKUP(AR41,Answers!U:V,2,FALSE),\"Help!\"))","v":""},null,{"$f":"IF(AS41=\"\",\"\",AQ41+IF(AS41=\"XX\",VLOOKUP(\"WRONG\",Answers!U:V,2,FALSE),AS41)+AT41)","v":""},{"$f":"Mainframe!N40","v":0},{"$f":"IF(AV41=0,\"\",IF(NOT(ISNA(VLOOKUP(AV41,Answers!W:X,2,FALSE))),VLOOKUP(AV41,Answers!W:X,2,FALSE),\"Help!\"))","v":""},null,{"$f":"IF(AW41=\"\",\"\",AU41+IF(AW41=\"XX\",VLOOKUP(\"WRONG\",Answers!W:X,2,FALSE),AW41)+AX41)","v":""},{"$f":"Mainframe!O40","v":0},{"$f":"IF(AZ41=0,\"\",IF(NOT(ISNA(VLOOKUP(AZ41,Answers!Y:Z,2,FALSE))),VLOOKUP(AZ41,Answers!Y:Z,2,FALSE),\"Help!\"))","v":""},null,{"$f":"IF(BA41=\"\",\"\",AY41+IF(BA41=\"XX\",VLOOKUP(\"WRONG\",Answers!Y:Z,2,FALSE),BA41)+BB41)","v":""},{"$f":"Mainframe!P40","v":0},{"$f":"IF(BD41=0,\"\",IF(NOT(ISNA(VLOOKUP(BD41,Answers!AA:AB,2,FALSE))),VLOOKUP(BD41,Answers!AA:AB,2,FALSE),\"Help!\"))","v":""},null,{"$f":"IF(BE41=\"\",\"\",BC41+IF(BE41=\"XX\",VLOOKUP(\"WRONG\",Answers!AA:AB,2,FALSE),BE41)+BF41)","v":""},{"$f":"Mainframe!Q40","v":0},{"$f":"IF(BH41=0,\"\",IF(NOT(ISNA(VLOOKUP(BH41,Answers!AC:AD,2,FALSE))),VLOOKUP(BH41,Answers!AC:AD,2,FALSE),\"Help!\"))","v":""},null,{"$f":"IF(BI41=\"\",\"\",BG41+IF(BI41=\"XX\",VLOOKUP(\"WRONG\",Answers!AC:AD,2,FALSE),BI41)+BJ41)","v":""},{"$f":"Mainframe!R40","v":0},{"$f":"IF(BL41=0,\"\",IF(NOT(ISNA(VLOOKUP(BL41,Answers!AE:AF,2,FALSE))),VLOOKUP(BL41,Answers!AE:AF,2,FALSE),\"Help!\"))","v":""},null,{"$f":"IF(BM41=\"\",\"\",BK41+IF(BM41=\"XX\",VLOOKUP(\"WRONG\",Answers!AE:AF,2,FALSE),BM41)+BN41)","v":""},{"$f":"Mainframe!S40","v":0},{"$f":"IF(BP41=0,\"\",IF(NOT(ISNA(VLOOKUP(BP41,Answers!AG:AH,2,FALSE))),VLOOKUP(BP41,Answers!AG:AH,2,FALSE),\"Help!\"))","v":""},null,{"$f":"IF(BQ41=\"\",\"\",BO41+IF(BQ41=\"XX\",VLOOKUP(\"WRONG\",Answers!AG:AH,2,FALSE),BQ41)+BR41)","v":""},{"$f":"Mainframe!T40","v":0},{"$f":"IF(BT41=0,\"\",IF(NOT(ISNA(VLOOKUP(BT41,Answers!AI:AJ,2,FALSE))),VLOOKUP(BT41,Answers!AI:AJ,2,FALSE),\"Help!\"))","v":""},null,{"$f":"IF(BU41=\"\",\"\",BS41+IF(BU41=\"XX\",VLOOKUP(\"WRONG\",Answers!AI:AJ,2,FALSE),BU41)+BV41)","v":""},{"$f":"Mainframe!U40","v":0},{"$f":"IF(BX41=0,\"\",IF(NOT(ISNA(VLOOKUP(BX41,Answers!AK:AL,2,FALSE))),VLOOKUP(BX41,Answers!AK:AL,2,FALSE),\"Help!\"))","v":""},null,{"$f":"IF(BY41=\"\",\"\",BW41+IF(BY41=\"XX\",VLOOKUP(\"WRONG\",Answers!AK:AL,2,FALSE),BY41)+BZ41)","v":""},{"$f":"Mainframe!V40","v":0},{"$f":"IF(CB41=0,\"\",IF(NOT(ISNA(VLOOKUP(CB41,Answers!AM:AN,2,FALSE))),VLOOKUP(CB41,Answers!AM:AN,2,FALSE),\"Help!\"))","v":""},null,{"$f":"IF(CC41=\"\",\"\",CA41+IF(CC41=\"XX\",VLOOKUP(\"WRONG\",Answers!AM:AN,2,FALSE),CC41)+CD41)","v":""},null,null,"","","","",""]
["[*]",{"$f":"Mainframe!B41","v":0},40,{"$f":"Mainframe!C41","v":0},{"$f":"IF(D42=0,\"\",IF(NOT(ISNA(VLOOKUP(D42,Answers!A:B,2,FALSE))),VLOOKUP(D42,Answers!A:B,2,FALSE),\"Help!\"))","v":""},null,{"$f":"IF(E42=\"\",\"\",IF(E42=\"XX\",VLOOKUP(\"WRONG\",Answers!A:B,2,FALSE),E42)+F42)","v":""},{"$f":"Mainframe!D41","v":0},{"$f":"IF(H42=0,\"\",IF(NOT(ISNA(VLOOKUP(H42,Answers!C:D,2,FALSE))),VLOOKUP(H42,Answers!C:D,2,FALSE),\"Help!\"))","v":""},null,{"$f":"IF(I42=\"\",\"\",G42+IF(I42=\"XX\",VLOOKUP(\"WRONG\",Answers!C:D,2,FALSE),I42)+J42)","v":""},{"$f":"Mainframe!E41","v":0},{"$f":"IF(L42=0,\"\",IF(NOT(ISNA(VLOOKUP(L42,Answers!E:F,2,FALSE))),VLOOKUP(L42,Answers!E:F,2,FALSE),\"Help!\"))","v":""},null,{"$f":"IF(M42=\"\",\"\",K42+IF(M42=\"XX\",VLOOKUP(\"WRONG\",Answers!E:F,2,FALSE),M42)+N42)","v":""},{"$f":"Mainframe!F41","v":0},{"$f":"IF(P42=0,\"\",IF(NOT(ISNA(VLOOKUP(P42,Answers!G:H,2,FALSE))),VLOOKUP(P42,Answers!G:H,2,FALSE),\"Help!\"))","v":""},null,{"$f":"IF(Q42=\"\",\"\",O42+IF(Q42=\"XX\",VLOOKUP(\"WRONG\",Answers!G:H,2,FALSE),Q42)+R42)","v":""},{"$f":"Mainframe!G41","v":0},{"$f":"IF(T42=0,\"\",IF(NOT(ISNA(VLOOKUP(T42,Answers!I:J,2,FALSE))),VLOOKUP(T42,Answers!I:J,2,FALSE),\"Help!\"))","v":""},null,{"$f":"IF(U42=\"\",\"\",S42+IF(U42=\"XX\",VLOOKUP(\"WRONG\",Answers!I:J,2,FALSE),U42)+V42)","v":""},{"$f":"Mainframe!H41","v":0},{"$f":"IF(X42=0,\"\",IF(NOT(ISNA(VLOOKUP(X42,Answers!K:L,2,FALSE))),VLOOKUP(X42,Answers!K:L,2,FALSE),\"Help!\"))","v":""},null,{"$f":"IF(Y42=\"\",\"\",W42+IF(Y42=\"XX\",VLOOKUP(\"WRONG\",Answers!K:L,2,FALSE),Y42)+Z42)","v":""},{"$f":"Mainframe!I41","v":0},{"$f":"IF(AB42=0,\"\",IF(NOT(ISNA(VLOOKUP(AB42,Answers!M:N,2,FALSE))),VLOOKUP(AB42,Answers!M:N,2,FALSE),\"Help!\"))","v":""},null,{"$f":"IF(AC42=\"\",\"\",AA42+IF(AC42=\"XX\",VLOOKUP(\"WRONG\",Answers!M:N,2,FALSE),AC42)+AD42)","v":""},{"$f":"Mainframe!J41","v":0},{"$f":"IF(AF42=0,\"\",IF(NOT(ISNA(VLOOKUP(AF42,Answers!O:P,2,FALSE))),VLOOKUP(AF42,Answers!O:P,2,FALSE),\"Help!\"))","v":""},null,{"$f":"IF(AG42=\"\",\"\",AE42+IF(AG42=\"XX\",VLOOKUP(\"WRONG\",Answers!O:P,2,FALSE),AG42)+AH42)","v":""},{"$f":"Mainframe!K41","v":0},{"$f":"IF(AJ42=0,\"\",IF(NOT(ISNA(VLOOKUP(AJ42,Answers!Q:R,2,FALSE))),VLOOKUP(AJ42,Answers!Q:R,2,FALSE),\"Help!\"))","v":""},null,{"$f":"IF(AK42=\"\",\"\",AI42+IF(AK42=\"XX\",VLOOKUP(\"WRONG\",Answers!Q:R,2,FALSE),AK42)+AL42)","v":""},{"$f":"Mainframe!L41","v":0},{"$f":"IF(AN42=0,\"\",IF(NOT(ISNA(VLOOKUP(AN42,Answers!S:T,2,FALSE))),VLOOKUP(AN42,Answers!S:T,2,FALSE),\"Help!\"))","v":""},null,{"$f":"IF(AO42=\"\",\"\",AM42+IF(AO42=\"XX\",VLOOKUP(\"WRONG\",Answers!S:T,2,FALSE),AO42)+AP42)","v":""},{"$f":"Mainframe!M41","v":0},{"$f":"IF(AR42=0,\"\",IF(NOT(ISNA(VLOOKUP(AR42,Answers!U:V,2,FALSE))),VLOOKUP(AR42,Answers!U:V,2,FALSE),\"Help!\"))","v":""},null,{"$f":"IF(AS42=\"\",\"\",AQ42+IF(AS42=\"XX\",VLOOKUP(\"WRONG\",Answers!U:V,2,FALSE),AS42)+AT42)","v":""},{"$f":"Mainframe!N41","v":0},{"$f":"IF(AV42=0,\"\",IF(NOT(ISNA(VLOOKUP(AV42,Answers!W:X,2,FALSE))),VLOOKUP(AV42,Answers!W:X,2,FALSE),\"Help!\"))","v":""},null,{"$f":"IF(AW42=\"\",\"\",AU42+IF(AW42=\"XX\",VLOOKUP(\"WRONG\",Answers!W:X,2,FALSE),AW42)+AX42)","v":""},{"$f":"Mainframe!O41","v":0},{"$f":"IF(AZ42=0,\"\",IF(NOT(ISNA(VLOOKUP(AZ42,Answers!Y:Z,2,FALSE))),VLOOKUP(AZ42,Answers!Y:Z,2,FALSE),\"Help!\"))","v":""},null,{"$f":"IF(BA42=\"\",\"\",AY42+IF(BA42=\"XX\",VLOOKUP(\"WRONG\",Answers!Y:Z,2,FALSE),BA42)+BB42)","v":""},{"$f":"Mainframe!P41","v":0},{"$f":"IF(BD42=0,\"\",IF(NOT(ISNA(VLOOKUP(BD42,Answers!AA:AB,2,FALSE))),VLOOKUP(BD42,Answers!AA:AB,2,FALSE),\"Help!\"))","v":""},null,{"$f":"IF(BE42=\"\",\"\",BC42+IF(BE42=\"XX\",VLOOKUP(\"WRONG\",Answers!AA:AB,2,FALSE),BE42)+BF42)","v":""},{"$f":"Mainframe!Q41","v":0},{"$f":"IF(BH42=0,\"\",IF(NOT(ISNA(VLOOKUP(BH42,Answers!AC:AD,2,FALSE))),VLOOKUP(BH42,Answers!AC:AD,2,FALSE),\"Help!\"))","v":""},null,{"$f":"IF(BI42=\"\",\"\",BG42+IF(BI42=\"XX\",VLOOKUP(\"WRONG\",Answers!AC:AD,2,FALSE),BI42)+BJ42)","v":""},{"$f":"Mainframe!R41","v":0},{"$f":"IF(BL42=0,\"\",IF(NOT(ISNA(VLOOKUP(BL42,Answers!AE:AF,2,FALSE))),VLOOKUP(BL42,Answers!AE:AF,2,FALSE),\"Help!\"))","v":""},null,{"$f":"IF(BM42=\"\",\"\",BK42+IF(BM42=\"XX\",VLOOKUP(\"WRONG\",Answers!AE:AF,2,FALSE),BM42)+BN42)","v":""},{"$f":"Mainframe!S41","v":0},{"$f":"IF(BP42=0,\"\",IF(NOT(ISNA(VLOOKUP(BP42,Answers!AG:AH,2,FALSE))),VLOOKUP(BP42,Answers!AG:AH,2,FALSE),\"Help!\"))","v":""},null,{"$f":"IF(BQ42=\"\",\"\",BO42+IF(BQ42=\"XX\",VLOOKUP(\"WRONG\",Answers!AG:AH,2,FALSE),BQ42)+BR42)","v":""},{"$f":"Mainframe!T41","v":0},{"$f":"IF(BT42=0,\"\",IF(NOT(ISNA(VLOOKUP(BT42,Answers!AI:AJ,2,FALSE))),VLOOKUP(BT42,Answers!AI:AJ,2,FALSE),\"Help!\"))","v":""},null,{"$f":"IF(BU42=\"\",\"\",BS42+IF(BU42=\"XX\",VLOOKUP(\"WRONG\",Answers!AI:AJ,2,FALSE),BU42)+BV42)","v":""},{"$f":"Mainframe!U41","v":0},{"$f":"IF(BX42=0,\"\",IF(NOT(ISNA(VLOOKUP(BX42,Answers!AK:AL,2,FALSE))),VLOOKUP(BX42,Answers!AK:AL,2,FALSE),\"Help!\"))","v":""},null,{"$f":"IF(BY42=\"\",\"\",BW42+IF(BY42=\"XX\",VLOOKUP(\"WRONG\",Answers!AK:AL,2,FALSE),BY42)+BZ42)","v":""},{"$f":"Mainframe!V41","v":0},{"$f":"IF(CB42=0,\"\",IF(NOT(ISNA(VLOOKUP(CB42,Answers!AM:AN,2,FALSE))),VLOOKUP(CB42,Answers!AM:AN,2,FALSE),\"Help!\"))","v":""},null,{"$f":"IF(CC42=\"\",\"\",CA42+IF(CC42=\"XX\",VLOOKUP(\"WRONG\",Answers!AM:AN,2,FALSE),CC42)+CD42)","v":""},null,null,"","","","",""]
["[*]",{"$f":"Mainframe!B42","v":0},41,{"$f":"Mainframe!C42","v":0},{"$f":"IF(D43=0,\"\",IF(NOT(ISNA(VLOOKUP(D43,Answers!A:B,2,FALSE))),VLOOKUP(D43,Answers!A:B,2,FALSE),\"Help!\"))","v":""},null,{"$f":"IF(E43=\"\",\"\",IF(E43=\"XX\",VLOOKUP(\"WRONG\",Answers!A:B,2,FALSE),E43)+F43)","v":""},{"$f":"Mainframe!D42","v":0},{"$f":"IF(H43=0,\"\",IF(NOT(ISNA(VLOOKUP(H43,Answers!C:D,2,FALSE))),VLOOKUP(H43,Answers!C:D,2,FALSE),\"Help!\"))","v":""},null,{"$f":"IF(I43=\"\",\"\",G43+IF(I43=\"XX\",VLOOKUP(\"WRONG\",Answers!C:D,2,FALSE),I43)+J43)","v":""},{"$f":"Mainframe!E42","v":0},{"$f":"IF(L43=0,\"\",IF(NOT(ISNA(VLOOKUP(L43,Answers!E:F,2,FALSE))),VLOOKUP(L43,Answers!E:F,2,FALSE),\"Help!\"))","v":""},null,{"$f":"IF(M43=\"\",\"\",K43+IF(M43=\"XX\",VLOOKUP(\"WRONG\",Answers!E:F,2,FALSE),M43)+N43)","v":""},{"$f":"Mainframe!F42","v":0},{"$f":"IF(P43=0,\"\",IF(NOT(ISNA(VLOOKUP(P43,Answers!G:H,2,FALSE))),VLOOKUP(P43,Answers!G:H,2,FALSE),\"Help!\"))","v":""},null,{"$f":"IF(Q43=\"\",\"\",O43+IF(Q43=\"XX\",VLOOKUP(\"WRONG\",Answers!G:H,2,FALSE),Q43)+R43)","v":""},{"$f":"Mainframe!G42","v":0},{"$f":"IF(T43=0,\"\",IF(NOT(ISNA(VLOOKUP(T43,Answers!I:J,2,FALSE))),VLOOKUP(T43,Answers!I:J,2,FALSE),\"Help!\"))","v":""},null,{"$f":"IF(U43=\"\",\"\",S43+IF(U43=\"XX\",VLOOKUP(\"WRONG\",Answers!I:J,2,FALSE),U43)+V43)","v":""},{"$f":"Mainframe!H42","v":0},{"$f":"IF(X43=0,\"\",IF(NOT(ISNA(VLOOKUP(X43,Answers!K:L,2,FALSE))),VLOOKUP(X43,Answers!K:L,2,FALSE),\"Help!\"))","v":""},null,{"$f":"IF(Y43=\"\",\"\",W43+IF(Y43=\"XX\",VLOOKUP(\"WRONG\",Answers!K:L,2,FALSE),Y43)+Z43)","v":""},{"$f":"Mainframe!I42","v":0},{"$f":"IF(AB43=0,\"\",IF(NOT(ISNA(VLOOKUP(AB43,Answers!M:N,2,FALSE))),VLOOKUP(AB43,Answers!M:N,2,FALSE),\"Help!\"))","v":""},null,{"$f":"IF(AC43=\"\",\"\",AA43+IF(AC43=\"XX\",VLOOKUP(\"WRONG\",Answers!M:N,2,FALSE),AC43)+AD43)","v":""},{"$f":"Mainframe!J42","v":0},{"$f":"IF(AF43=0,\"\",IF(NOT(ISNA(VLOOKUP(AF43,Answers!O:P,2,FALSE))),VLOOKUP(AF43,Answers!O:P,2,FALSE),\"Help!\"))","v":""},null,{"$f":"IF(AG43=\"\",\"\",AE43+IF(AG43=\"XX\",VLOOKUP(\"WRONG\",Answers!O:P,2,FALSE),AG43)+AH43)","v":""},{"$f":"Mainframe!K42","v":0},{"$f":"IF(AJ43=0,\"\",IF(NOT(ISNA(VLOOKUP(AJ43,Answers!Q:R,2,FALSE))),VLOOKUP(AJ43,Answers!Q:R,2,FALSE),\"Help!\"))","v":""},null,{"$f":"IF(AK43=\"\",\"\",AI43+IF(AK43=\"XX\",VLOOKUP(\"WRONG\",Answers!Q:R,2,FALSE),AK43)+AL43)","v":""},{"$f":"Mainframe!L42","v":0},{"$f":"IF(AN43=0,\"\",IF(NOT(ISNA(VLOOKUP(AN43,Answers!S:T,2,FALSE))),VLOOKUP(AN43,Answers!S:T,2,FALSE),\"Help!\"))","v":""},null,{"$f":"IF(AO43=\"\",\"\",AM43+IF(AO43=\"XX\",VLOOKUP(\"WRONG\",Answers!S:T,2,FALSE),AO43)+AP43)","v":""},{"$f":"Mainframe!M42","v":0},{"$f":"IF(AR43=0,\"\",IF(NOT(ISNA(VLOOKUP(AR43,Answers!U:V,2,FALSE))),VLOOKUP(AR43,Answers!U:V,2,FALSE),\"Help!\"))","v":""},null,{"$f":"IF(AS43=\"\",\"\",AQ43+IF(AS43=\"XX\",VLOOKUP(\"WRONG\",Answers!U:V,2,FALSE),AS43)+AT43)","v":""},{"$f":"Mainframe!N42","v":0},{"$f":"IF(AV43=0,\"\",IF(NOT(ISNA(VLOOKUP(AV43,Answers!W:X,2,FALSE))),VLOOKUP(AV43,Answers!W:X,2,FALSE),\"Help!\"))","v":""},null,{"$f":"IF(AW43=\"\",\"\",AU43+IF(AW43=\"XX\",VLOOKUP(\"WRONG\",Answers!W:X,2,FALSE),AW43)+AX43)","v":""},{"$f":"Mainframe!O42","v":0},{"$f":"IF(AZ43=0,\"\",IF(NOT(ISNA(VLOOKUP(AZ43,Answers!Y:Z,2,FALSE))),VLOOKUP(AZ43,Answers!Y:Z,2,FALSE),\"Help!\"))","v":""},null,{"$f":"IF(BA43=\"\",\"\",AY43+IF(BA43=\"XX\",VLOOKUP(\"WRONG\",Answers!Y:Z,2,FALSE),BA43)+BB43)","v":""},{"$f":"Mainframe!P42","v":0},{"$f":"IF(BD43=0,\"\",IF(NOT(ISNA(VLOOKUP(BD43,Answers!AA:AB,2,FALSE))),VLOOKUP(BD43,Answers!AA:AB,2,FALSE),\"Help!\"))","v":""},null,{"$f":"IF(BE43=\"\",\"\",BC43+IF(BE43=\"XX\",VLOOKUP(\"WRONG\",Answers!AA:AB,2,FALSE),BE43)+BF43)","v":""},{"$f":"Mainframe!Q42","v":0},{"$f":"IF(BH43=0,\"\",IF(NOT(ISNA(VLOOKUP(BH43,Answers!AC:AD,2,FALSE))),VLOOKUP(BH43,Answers!AC:AD,2,FALSE),\"Help!\"))","v":""},null,{"$f":"IF(BI43=\"\",\"\",BG43+IF(BI43=\"XX\",VLOOKUP(\"WRONG\",Answers!AC:AD,2,FALSE),BI43)+BJ43)","v":""},{"$f":"Mainframe!R42","v":0},{"$f":"IF(BL43=0,\"\",IF(NOT(ISNA(VLOOKUP(BL43,Answers!AE:AF,2,FALSE))),VLOOKUP(BL43,Answers!AE:AF,2,FALSE),\"Help!\"))","v":""},null,{"$f":"IF(BM43=\"\",\"\",BK43+IF(BM43=\"XX\",VLOOKUP(\"WRONG\",Answers!AE:AF,2,FALSE),BM43)+BN43)","v":""},{"$f":"Mainframe!S42","v":0},{"$f":"IF(BP43=0,\"\",IF(NOT(ISNA(VLOOKUP(BP43,Answers!AG:AH,2,FALSE))),VLOOKUP(BP43,Answers!AG:AH,2,FALSE),\"Help!\"))","v":""},null,{"$f":"IF(BQ43=\"\",\"\",BO43+IF(BQ43=\"XX\",VLOOKUP(\"WRONG\",Answers!AG:AH,2,FALSE),BQ43)+BR43)","v":""},{"$f":"Mainframe!T42","v":0},{"$f":"IF(BT43=0,\"\",IF(NOT(ISNA(VLOOKUP(BT43,Answers!AI:AJ,2,FALSE))),VLOOKUP(BT43,Answers!AI:AJ,2,FALSE),\"Help!\"))","v":""},null,{"$f":"IF(BU43=\"\",\"\",BS43+IF(BU43=\"XX\",VLOOKUP(\"WRONG\",Answers!AI:AJ,2,FALSE),BU43)+BV43)","v":""},{"$f":"Mainframe!U42","v":0},{"$f":"IF(BX43=0,\"\",IF(NOT(ISNA(VLOOKUP(BX43,Answers!AK:AL,2,FALSE))),VLOOKUP(BX43,Answers!AK:AL,2,FALSE),\"Help!\"))","v":""},null,{"$f":"IF(BY43=\"\",\"\",BW43+IF(BY43=\"XX\",VLOOKUP(\"WRONG\",Answers!AK:AL,2,FALSE),BY43)+BZ43)","v":""},{"$f":"Mainframe!V42","v":0},{"$f":"IF(CB43=0,\"\",IF(NOT(ISNA(VLOOKUP(CB43,Answers!AM:AN,2,FALSE))),VLOOKUP(CB43,Answers!AM:AN,2,FALSE),\"Help!\"))","v":""},null,{"$f":"IF(CC43=\"\",\"\",CA43+IF(CC43=\"XX\",VLOOKUP(\"WRONG\",Answers!AM:AN,2,FALSE),CC43)+CD43)","v":""},null,null,"","","","",""]
["[*]",{"$f":"Mainframe!B43","v":0},42,{"$f":"Mainframe!C43","v":0},{"$f":"IF(D44=0,\"\",IF(NOT(ISNA(VLOOKUP(D44,Answers!A:B,2,FALSE))),VLOOKUP(D44,Answers!A:B,2,FALSE),\"Help!\"))","v":""},null,{"$f":"IF(E44=\"\",\"\",IF(E44=\"XX\",VLOOKUP(\"WRONG\",Answers!A:B,2,FALSE),E44)+F44)","v":""},{"$f":"Mainframe!D43","v":0},{"$f":"IF(H44=0,\"\",IF(NOT(ISNA(VLOOKUP(H44,Answers!C:D,2,FALSE))),VLOOKUP(H44,Answers!C:D,2,FALSE),\"Help!\"))","v":""},null,{"$f":"IF(I44=\"\",\"\",G44+IF(I44=\"XX\",VLOOKUP(\"WRONG\",Answers!C:D,2,FALSE),I44)+J44)","v":""},{"$f":"Mainframe!E43","v":0},{"$f":"IF(L44=0,\"\",IF(NOT(ISNA(VLOOKUP(L44,Answers!E:F,2,FALSE))),VLOOKUP(L44,Answers!E:F,2,FALSE),\"Help!\"))","v":""},null,{"$f":"IF(M44=\"\",\"\",K44+IF(M44=\"XX\",VLOOKUP(\"WRONG\",Answers!E:F,2,FALSE),M44)+N44)","v":""},{"$f":"Mainframe!F43","v":0},{"$f":"IF(P44=0,\"\",IF(NOT(ISNA(VLOOKUP(P44,Answers!G:H,2,FALSE))),VLOOKUP(P44,Answers!G:H,2,FALSE),\"Help!\"))","v":""},null,{"$f":"IF(Q44=\"\",\"\",O44+IF(Q44=\"XX\",VLOOKUP(\"WRONG\",Answers!G:H,2,FALSE),Q44)+R44)","v":""},{"$f":"Mainframe!G43","v":0},{"$f":"IF(T44=0,\"\",IF(NOT(ISNA(VLOOKUP(T44,Answers!I:J,2,FALSE))),VLOOKUP(T44,Answers!I:J,2,FALSE),\"Help!\"))","v":""},null,{"$f":"IF(U44=\"\",\"\",S44+IF(U44=\"XX\",VLOOKUP(\"WRONG\",Answers!I:J,2,FALSE),U44)+V44)","v":""},{"$f":"Mainframe!H43","v":0},{"$f":"IF(X44=0,\"\",IF(NOT(ISNA(VLOOKUP(X44,Answers!K:L,2,FALSE))),VLOOKUP(X44,Answers!K:L,2,FALSE),\"Help!\"))","v":""},null,{"$f":"IF(Y44=\"\",\"\",W44+IF(Y44=\"XX\",VLOOKUP(\"WRONG\",Answers!K:L,2,FALSE),Y44)+Z44)","v":""},{"$f":"Mainframe!I43","v":0},{"$f":"IF(AB44=0,\"\",IF(NOT(ISNA(VLOOKUP(AB44,Answers!M:N,2,FALSE))),VLOOKUP(AB44,Answers!M:N,2,FALSE),\"Help!\"))","v":""},null,{"$f":"IF(AC44=\"\",\"\",AA44+IF(AC44=\"XX\",VLOOKUP(\"WRONG\",Answers!M:N,2,FALSE),AC44)+AD44)","v":""},{"$f":"Mainframe!J43","v":0},{"$f":"IF(AF44=0,\"\",IF(NOT(ISNA(VLOOKUP(AF44,Answers!O:P,2,FALSE))),VLOOKUP(AF44,Answers!O:P,2,FALSE),\"Help!\"))","v":""},null,{"$f":"IF(AG44=\"\",\"\",AE44+IF(AG44=\"XX\",VLOOKUP(\"WRONG\",Answers!O:P,2,FALSE),AG44)+AH44)","v":""},{"$f":"Mainframe!K43","v":0},{"$f":"IF(AJ44=0,\"\",IF(NOT(ISNA(VLOOKUP(AJ44,Answers!Q:R,2,FALSE))),VLOOKUP(AJ44,Answers!Q:R,2,FALSE),\"Help!\"))","v":""},null,{"$f":"IF(AK44=\"\",\"\",AI44+IF(AK44=\"XX\",VLOOKUP(\"WRONG\",Answers!Q:R,2,FALSE),AK44)+AL44)","v":""},{"$f":"Mainframe!L43","v":0},{"$f":"IF(AN44=0,\"\",IF(NOT(ISNA(VLOOKUP(AN44,Answers!S:T,2,FALSE))),VLOOKUP(AN44,Answers!S:T,2,FALSE),\"Help!\"))","v":""},null,{"$f":"IF(AO44=\"\",\"\",AM44+IF(AO44=\"XX\",VLOOKUP(\"WRONG\",Answers!S:T,2,FALSE),AO44)+AP44)","v":""},{"$f":"Mainframe!M43","v":0},{"$f":"IF(AR44=0,\"\",IF(NOT(ISNA(VLOOKUP(AR44,Answers!U:V,2,FALSE))),VLOOKUP(AR44,Answers!U:V,2,FALSE),\"Help!\"))","v":""},null,{"$f":"IF(AS44=\"\",\"\",AQ44+IF(AS44=\"XX\",VLOOKUP(\"WRONG\",Answers!U:V,2,FALSE),AS44)+AT44)","v":""},{"$f":"Mainframe!N43","v":0},{"$f":"IF(AV44=0,\"\",IF(NOT(ISNA(VLOOKUP(AV44,Answers!W:X,2,FALSE))),VLOOKUP(AV44,Answers!W:X,2,FALSE),\"Help!\"))","v":""},null,{"$f":"IF(AW44=\"\",\"\",AU44+IF(AW44=\"XX\",VLOOKUP(\"WRONG\",Answers!W:X,2,FALSE),AW44)+AX44)","v":""},{"$f":"Mainframe!O43","v":0},{"$f":"IF(AZ44=0,\"\",IF(NOT(ISNA(VLOOKUP(AZ44,Answers!Y:Z,2,FALSE))),VLOOKUP(AZ44,Answers!Y:Z,2,FALSE),\"Help!\"))","v":""},null,{"$f":"IF(BA44=\"\",\"\",AY44+IF(BA44=\"XX\",VLOOKUP(\"WRONG\",Answers!Y:Z,2,FALSE),BA44)+BB44)","v":""},{"$f":"Mainframe!P43","v":0},{"$f":"IF(BD44=0,\"\",IF(NOT(ISNA(VLOOKUP(BD44,Answers!AA:AB,2,FALSE))),VLOOKUP(BD44,Answers!AA:AB,2,FALSE),\"Help!\"))","v":""},null,{"$f":"IF(BE44=\"\",\"\",BC44+IF(BE44=\"XX\",VLOOKUP(\"WRONG\",Answers!AA:AB,2,FALSE),BE44)+BF44)","v":""},{"$f":"Mainframe!Q43","v":0},{"$f":"IF(BH44=0,\"\",IF(NOT(ISNA(VLOOKUP(BH44,Answers!AC:AD,2,FALSE))),VLOOKUP(BH44,Answers!AC:AD,2,FALSE),\"Help!\"))","v":""},null,{"$f":"IF(BI44=\"\",\"\",BG44+IF(BI44=\"XX\",VLOOKUP(\"WRONG\",Answers!AC:AD,2,FALSE),BI44)+BJ44)","v":""},{"$f":"Mainframe!R43","v":0},{"$f":"IF(BL44=0,\"\",IF(NOT(ISNA(VLOOKUP(BL44,Answers!AE:AF,2,FALSE))),VLOOKUP(BL44,Answers!AE:AF,2,FALSE),\"Help!\"))","v":""},null,{"$f":"IF(BM44=\"\",\"\",BK44+IF(BM44=\"XX\",VLOOKUP(\"WRONG\",Answers!AE:AF,2,FALSE),BM44)+BN44)","v":""},{"$f":"Mainframe!S43","v":0},{"$f":"IF(BP44=0,\"\",IF(NOT(ISNA(VLOOKUP(BP44,Answers!AG:AH,2,FALSE))),VLOOKUP(BP44,Answers!AG:AH,2,FALSE),\"Help!\"))","v":""},null,{"$f":"IF(BQ44=\"\",\"\",BO44+IF(BQ44=\"XX\",VLOOKUP(\"WRONG\",Answers!AG:AH,2,FALSE),BQ44)+BR44)","v":""},{"$f":"Mainframe!T43","v":0},{"$f":"IF(BT44=0,\"\",IF(NOT(ISNA(VLOOKUP(BT44,Answers!AI:AJ,2,FALSE))),VLOOKUP(BT44,Answers!AI:AJ,2,FALSE),\"Help!\"))","v":""},null,{"$f":"IF(BU44=\"\",\"\",BS44+IF(BU44=\"XX\",VLOOKUP(\"WRONG\",Answers!AI:AJ,2,FALSE),BU44)+BV44)","v":""},{"$f":"Mainframe!U43","v":0},{"$f":"IF(BX44=0,\"\",IF(NOT(ISNA(VLOOKUP(BX44,Answers!AK:AL,2,FALSE))),VLOOKUP(BX44,Answers!AK:AL,2,FALSE),\"Help!\"))","v":""},null,{"$f":"IF(BY44=\"\",\"\",BW44+IF(BY44=\"XX\",VLOOKUP(\"WRONG\",Answers!AK:AL,2,FALSE),BY44)+BZ44)","v":""},{"$f":"Mainframe!V43","v":0},{"$f":"IF(CB44=0,\"\",IF(NOT(ISNA(VLOOKUP(CB44,Answers!AM:AN,2,FALSE))),VLOOKUP(CB44,Answers!AM:AN,2,FALSE),\"Help!\"))","v":""},null,{"$f":"IF(CC44=\"\",\"\",CA44+IF(CC44=\"XX\",VLOOKUP(\"WRONG\",Answers!AM:AN,2,FALSE),CC44)+CD44)","v":""},null,null,"","","","",""]
["[*]",{"$f":"Mainframe!B44","v":0},43,{"$f":"Mainframe!C44","v":0},{"$f":"IF(D45=0,\"\",IF(NOT(ISNA(VLOOKUP(D45,Answers!A:B,2,FALSE))),VLOOKUP(D45,Answers!A:B,2,FALSE),\"Help!\"))","v":""},null,{"$f":"IF(E45=\"\",\"\",IF(E45=\"XX\",VLOOKUP(\"WRONG\",Answers!A:B,2,FALSE),E45)+F45)","v":""},{"$f":"Mainframe!D44","v":0},{"$f":"IF(H45=0,\"\",IF(NOT(ISNA(VLOOKUP(H45,Answers!C:D,2,FALSE))),VLOOKUP(H45,Answers!C:D,2,FALSE),\"Help!\"))","v":""},null,{"$f":"IF(I45=\"\",\"\",G45+IF(I45=\"XX\",VLOOKUP(\"WRONG\",Answers!C:D,2,FALSE),I45)+J45)","v":""},{"$f":"Mainframe!E44","v":0},{"$f":"IF(L45=0,\"\",IF(NOT(ISNA(VLOOKUP(L45,Answers!E:F,2,FALSE))),VLOOKUP(L45,Answers!E:F,2,FALSE),\"Help!\"))","v":""},null,{"$f":"IF(M45=\"\",\"\",K45+IF(M45=\"XX\",VLOOKUP(\"WRONG\",Answers!E:F,2,FALSE),M45)+N45)","v":""},{"$f":"Mainframe!F44","v":0},{"$f":"IF(P45=0,\"\",IF(NOT(ISNA(VLOOKUP(P45,Answers!G:H,2,FALSE))),VLOOKUP(P45,Answers!G:H,2,FALSE),\"Help!\"))","v":""},null,{"$f":"IF(Q45=\"\",\"\",O45+IF(Q45=\"XX\",VLOOKUP(\"WRONG\",Answers!G:H,2,FALSE),Q45)+R45)","v":""},{"$f":"Mainframe!G44","v":0},{"$f":"IF(T45=0,\"\",IF(NOT(ISNA(VLOOKUP(T45,Answers!I:J,2,FALSE))),VLOOKUP(T45,Answers!I:J,2,FALSE),\"Help!\"))","v":""},null,{"$f":"IF(U45=\"\",\"\",S45+IF(U45=\"XX\",VLOOKUP(\"WRONG\",Answers!I:J,2,FALSE),U45)+V45)","v":""},{"$f":"Mainframe!H44","v":0},{"$f":"IF(X45=0,\"\",IF(NOT(ISNA(VLOOKUP(X45,Answers!K:L,2,FALSE))),VLOOKUP(X45,Answers!K:L,2,FALSE),\"Help!\"))","v":""},null,{"$f":"IF(Y45=\"\",\"\",W45+IF(Y45=\"XX\",VLOOKUP(\"WRONG\",Answers!K:L,2,FALSE),Y45)+Z45)","v":""},{"$f":"Mainframe!I44","v":0},{"$f":"IF(AB45=0,\"\",IF(NOT(ISNA(VLOOKUP(AB45,Answers!M:N,2,FALSE))),VLOOKUP(AB45,Answers!M:N,2,FALSE),\"Help!\"))","v":""},null,{"$f":"IF(AC45=\"\",\"\",AA45+IF(AC45=\"XX\",VLOOKUP(\"WRONG\",Answers!M:N,2,FALSE),AC45)+AD45)","v":""},{"$f":"Mainframe!J44","v":0},{"$f":"IF(AF45=0,\"\",IF(NOT(ISNA(VLOOKUP(AF45,Answers!O:P,2,FALSE))),VLOOKUP(AF45,Answers!O:P,2,FALSE),\"Help!\"))","v":""},null,{"$f":"IF(AG45=\"\",\"\",AE45+IF(AG45=\"XX\",VLOOKUP(\"WRONG\",Answers!O:P,2,FALSE),AG45)+AH45)","v":""},{"$f":"Mainframe!K44","v":0},{"$f":"IF(AJ45=0,\"\",IF(NOT(ISNA(VLOOKUP(AJ45,Answers!Q:R,2,FALSE))),VLOOKUP(AJ45,Answers!Q:R,2,FALSE),\"Help!\"))","v":""},null,{"$f":"IF(AK45=\"\",\"\",AI45+IF(AK45=\"XX\",VLOOKUP(\"WRONG\",Answers!Q:R,2,FALSE),AK45)+AL45)","v":""},{"$f":"Mainframe!L44","v":0},{"$f":"IF(AN45=0,\"\",IF(NOT(ISNA(VLOOKUP(AN45,Answers!S:T,2,FALSE))),VLOOKUP(AN45,Answers!S:T,2,FALSE),\"Help!\"))","v":""},null,{"$f":"IF(AO45=\"\",\"\",AM45+IF(AO45=\"XX\",VLOOKUP(\"WRONG\",Answers!S:T,2,FALSE),AO45)+AP45)","v":""},{"$f":"Mainframe!M44","v":0},{"$f":"IF(AR45=0,\"\",IF(NOT(ISNA(VLOOKUP(AR45,Answers!U:V,2,FALSE))),VLOOKUP(AR45,Answers!U:V,2,FALSE),\"Help!\"))","v":""},null,{"$f":"IF(AS45=\"\",\"\",AQ45+IF(AS45=\"XX\",VLOOKUP(\"WRONG\",Answers!U:V,2,FALSE),AS45)+AT45)","v":""},{"$f":"Mainframe!N44","v":0},{"$f":"IF(AV45=0,\"\",IF(NOT(ISNA(VLOOKUP(AV45,Answers!W:X,2,FALSE))),VLOOKUP(AV45,Answers!W:X,2,FALSE),\"Help!\"))","v":""},null,{"$f":"IF(AW45=\"\",\"\",AU45+IF(AW45=\"XX\",VLOOKUP(\"WRONG\",Answers!W:X,2,FALSE),AW45)+AX45)","v":""},{"$f":"Mainframe!O44","v":0},{"$f":"IF(AZ45=0,\"\",IF(NOT(ISNA(VLOOKUP(AZ45,Answers!Y:Z,2,FALSE))),VLOOKUP(AZ45,Answers!Y:Z,2,FALSE),\"Help!\"))","v":""},null,{"$f":"IF(BA45=\"\",\"\",AY45+IF(BA45=\"XX\",VLOOKUP(\"WRONG\",Answers!Y:Z,2,FALSE),BA45)+BB45)","v":""},{"$f":"Mainframe!P44","v":0},{"$f":"IF(BD45=0,\"\",IF(NOT(ISNA(VLOOKUP(BD45,Answers!AA:AB,2,FALSE))),VLOOKUP(BD45,Answers!AA:AB,2,FALSE),\"Help!\"))","v":""},null,{"$f":"IF(BE45=\"\",\"\",BC45+IF(BE45=\"XX\",VLOOKUP(\"WRONG\",Answers!AA:AB,2,FALSE),BE45)+BF45)","v":""},{"$f":"Mainframe!Q44","v":0},{"$f":"IF(BH45=0,\"\",IF(NOT(ISNA(VLOOKUP(BH45,Answers!AC:AD,2,FALSE))),VLOOKUP(BH45,Answers!AC:AD,2,FALSE),\"Help!\"))","v":""},null,{"$f":"IF(BI45=\"\",\"\",BG45+IF(BI45=\"XX\",VLOOKUP(\"WRONG\",Answers!AC:AD,2,FALSE),BI45)+BJ45)","v":""},{"$f":"Mainframe!R44","v":0},{"$f":"IF(BL45=0,\"\",IF(NOT(ISNA(VLOOKUP(BL45,Answers!AE:AF,2,FALSE))),VLOOKUP(BL45,Answers!AE:AF,2,FALSE),\"Help!\"))","v":""},null,{"$f":"IF(BM45=\"\",\"\",BK45+IF(BM45=\"XX\",VLOOKUP(\"WRONG\",Answers!AE:AF,2,FALSE),BM45)+BN45)","v":""},{"$f":"Mainframe!S44","v":0},{"$f":"IF(BP45=0,\"\",IF(NOT(ISNA(VLOOKUP(BP45,Answers!AG:AH,2,FALSE))),VLOOKUP(BP45,Answers!AG:AH,2,FALSE),\"Help!\"))","v":""},null,{"$f":"IF(BQ45=\"\",\"\",BO45+IF(BQ45=\"XX\",VLOOKUP(\"WRONG\",Answers!AG:AH,2,FALSE),BQ45)+BR45)","v":""},{"$f":"Mainframe!T44","v":0},{"$f":"IF(BT45=0,\"\",IF(NOT(ISNA(VLOOKUP(BT45,Answers!AI:AJ,2,FALSE))),VLOOKUP(BT45,Answers!AI:AJ,2,FALSE),\"Help!\"))","v":""},null,{"$f":"IF(BU45=\"\",\"\",BS45+IF(BU45=\"XX\",VLOOKUP(\"WRONG\",Answers!AI:AJ,2,FALSE),BU45)+BV45)","v":""},{"$f":"Mainframe!U44","v":0},{"$f":"IF(BX45=0,\"\",IF(NOT(ISNA(VLOOKUP(BX45,Answers!AK:AL,2,FALSE))),VLOOKUP(BX45,Answers!AK:AL,2,FALSE),\"Help!\"))","v":""},null,{"$f":"IF(BY45=\"\",\"\",BW45+IF(BY45=\"XX\",VLOOKUP(\"WRONG\",Answers!AK:AL,2,FALSE),BY45)+BZ45)","v":""},{"$f":"Mainframe!V44","v":0},{"$f":"IF(CB45=0,\"\",IF(NOT(ISNA(VLOOKUP(CB45,Answers!AM:AN,2,FALSE))),VLOOKUP(CB45,Answers!AM:AN,2,FALSE),\"Help!\"))","v":""},null,{"$f":"IF(CC45=\"\",\"\",CA45+IF(CC45=\"XX\",VLOOKUP(\"WRONG\",Answers!AM:AN,2,FALSE),CC45)+CD45)","v":""},null,null,"","","","",""]
["[*]",{"$f":"Mainframe!B45","v":0},44,{"$f":"Mainframe!C45","v":0},{"$f":"IF(D46=0,\"\",IF(NOT(ISNA(VLOOKUP(D46,Answers!A:B,2,FALSE))),VLOOKUP(D46,Answers!A:B,2,FALSE),\"Help!\"))","v":""},null,{"$f":"IF(E46=\"\",\"\",IF(E46=\"XX\",VLOOKUP(\"WRONG\",Answers!A:B,2,FALSE),E46)+F46)","v":""},{"$f":"Mainframe!D45","v":0},{"$f":"IF(H46=0,\"\",IF(NOT(ISNA(VLOOKUP(H46,Answers!C:D,2,FALSE))),VLOOKUP(H46,Answers!C:D,2,FALSE),\"Help!\"))","v":""},null,{"$f":"IF(I46=\"\",\"\",G46+IF(I46=\"XX\",VLOOKUP(\"WRONG\",Answers!C:D,2,FALSE),I46)+J46)","v":""},{"$f":"Mainframe!E45","v":0},{"$f":"IF(L46=0,\"\",IF(NOT(ISNA(VLOOKUP(L46,Answers!E:F,2,FALSE))),VLOOKUP(L46,Answers!E:F,2,FALSE),\"Help!\"))","v":""},null,{"$f":"IF(M46=\"\",\"\",K46+IF(M46=\"XX\",VLOOKUP(\"WRONG\",Answers!E:F,2,FALSE),M46)+N46)","v":""},{"$f":"Mainframe!F45","v":0},{"$f":"IF(P46=0,\"\",IF(NOT(ISNA(VLOOKUP(P46,Answers!G:H,2,FALSE))),VLOOKUP(P46,Answers!G:H,2,FALSE),\"Help!\"))","v":""},null,{"$f":"IF(Q46=\"\",\"\",O46+IF(Q46=\"XX\",VLOOKUP(\"WRONG\",Answers!G:H,2,FALSE),Q46)+R46)","v":""},{"$f":"Mainframe!G45","v":0},{"$f":"IF(T46=0,\"\",IF(NOT(ISNA(VLOOKUP(T46,Answers!I:J,2,FALSE))),VLOOKUP(T46,Answers!I:J,2,FALSE),\"Help!\"))","v":""},null,{"$f":"IF(U46=\"\",\"\",S46+IF(U46=\"XX\",VLOOKUP(\"WRONG\",Answers!I:J,2,FALSE),U46)+V46)","v":""},{"$f":"Mainframe!H45","v":0},{"$f":"IF(X46=0,\"\",IF(NOT(ISNA(VLOOKUP(X46,Answers!K:L,2,FALSE))),VLOOKUP(X46,Answers!K:L,2,FALSE),\"Help!\"))","v":""},null,{"$f":"IF(Y46=\"\",\"\",W46+IF(Y46=\"XX\",VLOOKUP(\"WRONG\",Answers!K:L,2,FALSE),Y46)+Z46)","v":""},{"$f":"Mainframe!I45","v":0},{"$f":"IF(AB46=0,\"\",IF(NOT(ISNA(VLOOKUP(AB46,Answers!M:N,2,FALSE))),VLOOKUP(AB46,Answers!M:N,2,FALSE),\"Help!\"))","v":""},null,{"$f":"IF(AC46=\"\",\"\",AA46+IF(AC46=\"XX\",VLOOKUP(\"WRONG\",Answers!M:N,2,FALSE),AC46)+AD46)","v":""},{"$f":"Mainframe!J45","v":0},{"$f":"IF(AF46=0,\"\",IF(NOT(ISNA(VLOOKUP(AF46,Answers!O:P,2,FALSE))),VLOOKUP(AF46,Answers!O:P,2,FALSE),\"Help!\"))","v":""},null,{"$f":"IF(AG46=\"\",\"\",AE46+IF(AG46=\"XX\",VLOOKUP(\"WRONG\",Answers!O:P,2,FALSE),AG46)+AH46)","v":""},{"$f":"Mainframe!K45","v":0},{"$f":"IF(AJ46=0,\"\",IF(NOT(ISNA(VLOOKUP(AJ46,Answers!Q:R,2,FALSE))),VLOOKUP(AJ46,Answers!Q:R,2,FALSE),\"Help!\"))","v":""},null,{"$f":"IF(AK46=\"\",\"\",AI46+IF(AK46=\"XX\",VLOOKUP(\"WRONG\",Answers!Q:R,2,FALSE),AK46)+AL46)","v":""},{"$f":"Mainframe!L45","v":0},{"$f":"IF(AN46=0,\"\",IF(NOT(ISNA(VLOOKUP(AN46,Answers!S:T,2,FALSE))),VLOOKUP(AN46,Answers!S:T,2,FALSE),\"Help!\"))","v":""},null,{"$f":"IF(AO46=\"\",\"\",AM46+IF(AO46=\"XX\",VLOOKUP(\"WRONG\",Answers!S:T,2,FALSE),AO46)+AP46)","v":""},{"$f":"Mainframe!M45","v":0},{"$f":"IF(AR46=0,\"\",IF(NOT(ISNA(VLOOKUP(AR46,Answers!U:V,2,FALSE))),VLOOKUP(AR46,Answers!U:V,2,FALSE),\"Help!\"))","v":""},null,{"$f":"IF(AS46=\"\",\"\",AQ46+IF(AS46=\"XX\",VLOOKUP(\"WRONG\",Answers!U:V,2,FALSE),AS46)+AT46)","v":""},{"$f":"Mainframe!N45","v":0},{"$f":"IF(AV46=0,\"\",IF(NOT(ISNA(VLOOKUP(AV46,Answers!W:X,2,FALSE))),VLOOKUP(AV46,Answers!W:X,2,FALSE),\"Help!\"))","v":""},null,{"$f":"IF(AW46=\"\",\"\",AU46+IF(AW46=\"XX\",VLOOKUP(\"WRONG\",Answers!W:X,2,FALSE),AW46)+AX46)","v":""},{"$f":"Mainframe!O45","v":0},{"$f":"IF(AZ46=0,\"\",IF(NOT(ISNA(VLOOKUP(AZ46,Answers!Y:Z,2,FALSE))),VLOOKUP(AZ46,Answers!Y:Z,2,FALSE),\"Help!\"))","v":""},null,{"$f":"IF(BA46=\"\",\"\",AY46+IF(BA46=\"XX\",VLOOKUP(\"WRONG\",Answers!Y:Z,2,FALSE),BA46)+BB46)","v":""},{"$f":"Mainframe!P45","v":0},{"$f":"IF(BD46=0,\"\",IF(NOT(ISNA(VLOOKUP(BD46,Answers!AA:AB,2,FALSE))),VLOOKUP(BD46,Answers!AA:AB,2,FALSE),\"Help!\"))","v":""},null,{"$f":"IF(BE46=\"\",\"\",BC46+IF(BE46=\"XX\",VLOOKUP(\"WRONG\",Answers!AA:AB,2,FALSE),BE46)+BF46)","v":""},{"$f":"Mainframe!Q45","v":0},{"$f":"IF(BH46=0,\"\",IF(NOT(ISNA(VLOOKUP(BH46,Answers!AC:AD,2,FALSE))),VLOOKUP(BH46,Answers!AC:AD,2,FALSE),\"Help!\"))","v":""},null,{"$f":"IF(BI46=\"\",\"\",BG46+IF(BI46=\"XX\",VLOOKUP(\"WRONG\",Answers!AC:AD,2,FALSE),BI46)+BJ46)","v":""},{"$f":"Mainframe!R45","v":0},{"$f":"IF(BL46=0,\"\",IF(NOT(ISNA(VLOOKUP(BL46,Answers!AE:AF,2,FALSE))),VLOOKUP(BL46,Answers!AE:AF,2,FALSE),\"Help!\"))","v":""},null,{"$f":"IF(BM46=\"\",\"\",BK46+IF(BM46=\"XX\",VLOOKUP(\"WRONG\",Answers!AE:AF,2,FALSE),BM46)+BN46)","v":""},{"$f":"Mainframe!S45","v":0},{"$f":"IF(BP46=0,\"\",IF(NOT(ISNA(VLOOKUP(BP46,Answers!AG:AH,2,FALSE))),VLOOKUP(BP46,Answers!AG:AH,2,FALSE),\"Help!\"))","v":""},null,{"$f":"IF(BQ46=\"\",\"\",BO46+IF(BQ46=\"XX\",VLOOKUP(\"WRONG\",Answers!AG:AH,2,FALSE),BQ46)+BR46)","v":""},{"$f":"Mainframe!T45","v":0},{"$f":"IF(BT46=0,\"\",IF(NOT(ISNA(VLOOKUP(BT46,Answers!AI:AJ,2,FALSE))),VLOOKUP(BT46,Answers!AI:AJ,2,FALSE),\"Help!\"))","v":""},null,{"$f":"IF(BU46=\"\",\"\",BS46+IF(BU46=\"XX\",VLOOKUP(\"WRONG\",Answers!AI:AJ,2,FALSE),BU46)+BV46)","v":""},{"$f":"Mainframe!U45","v":0},{"$f":"IF(BX46=0,\"\",IF(NOT(ISNA(VLOOKUP(BX46,Answers!AK:AL,2,FALSE))),VLOOKUP(BX46,Answers!AK:AL,2,FALSE),\"Help!\"))","v":""},null,{"$f":"IF(BY46=\"\",\"\",BW46+IF(BY46=\"XX\",VLOOKUP(\"WRONG\",Answers!AK:AL,2,FALSE),BY46)+BZ46)","v":""},{"$f":"Mainframe!V45","v":0},{"$f":"IF(CB46=0,\"\",IF(NOT(ISNA(VLOOKUP(CB46,Answers!AM:AN,2,FALSE))),VLOOKUP(CB46,Answers!AM:AN,2,FALSE),\"Help!\"))","v":""},null,{"$f":"IF(CC46=\"\",\"\",CA46+IF(CC46=\"XX\",VLOOKUP(\"WRONG\",Answers!AM:AN,2,FALSE),CC46)+CD46)","v":""},null,null,"","","","",""]
["[*]",{"$f":"Mainframe!B46","v":0},45,{"$f":"Mainframe!C46","v":0},{"$f":"IF(D47=0,\"\",IF(NOT(ISNA(VLOOKUP(D47,Answers!A:B,2,FALSE))),VLOOKUP(D47,Answers!A:B,2,FALSE),\"Help!\"))","v":""},null,{"$f":"IF(E47=\"\",\"\",IF(E47=\"XX\",VLOOKUP(\"WRONG\",Answers!A:B,2,FALSE),E47)+F47)","v":""},{"$f":"Mainframe!D46","v":0},{"$f":"IF(H47=0,\"\",IF(NOT(ISNA(VLOOKUP(H47,Answers!C:D,2,FALSE))),VLOOKUP(H47,Answers!C:D,2,FALSE),\"Help!\"))","v":""},null,{"$f":"IF(I47=\"\",\"\",G47+IF(I47=\"XX\",VLOOKUP(\"WRONG\",Answers!C:D,2,FALSE),I47)+J47)","v":""},{"$f":"Mainframe!E46","v":0},{"$f":"IF(L47=0,\"\",IF(NOT(ISNA(VLOOKUP(L47,Answers!E:F,2,FALSE))),VLOOKUP(L47,Answers!E:F,2,FALSE),\"Help!\"))","v":""},null,{"$f":"IF(M47=\"\",\"\",K47+IF(M47=\"XX\",VLOOKUP(\"WRONG\",Answers!E:F,2,FALSE),M47)+N47)","v":""},{"$f":"Mainframe!F46","v":0},{"$f":"IF(P47=0,\"\",IF(NOT(ISNA(VLOOKUP(P47,Answers!G:H,2,FALSE))),VLOOKUP(P47,Answers!G:H,2,FALSE),\"Help!\"))","v":""},null,{"$f":"IF(Q47=\"\",\"\",O47+IF(Q47=\"XX\",VLOOKUP(\"WRONG\",Answers!G:H,2,FALSE),Q47)+R47)","v":""},{"$f":"Mainframe!G46","v":0},{"$f":"IF(T47=0,\"\",IF(NOT(ISNA(VLOOKUP(T47,Answers!I:J,2,FALSE))),VLOOKUP(T47,Answers!I:J,2,FALSE),\"Help!\"))","v":""},null,{"$f":"IF(U47=\"\",\"\",S47+IF(U47=\"XX\",VLOOKUP(\"WRONG\",Answers!I:J,2,FALSE),U47)+V47)","v":""},{"$f":"Mainframe!H46","v":0},{"$f":"IF(X47=0,\"\",IF(NOT(ISNA(VLOOKUP(X47,Answers!K:L,2,FALSE))),VLOOKUP(X47,Answers!K:L,2,FALSE),\"Help!\"))","v":""},null,{"$f":"IF(Y47=\"\",\"\",W47+IF(Y47=\"XX\",VLOOKUP(\"WRONG\",Answers!K:L,2,FALSE),Y47)+Z47)","v":""},{"$f":"Mainframe!I46","v":0},{"$f":"IF(AB47=0,\"\",IF(NOT(ISNA(VLOOKUP(AB47,Answers!M:N,2,FALSE))),VLOOKUP(AB47,Answers!M:N,2,FALSE),\"Help!\"))","v":""},null,{"$f":"IF(AC47=\"\",\"\",AA47+IF(AC47=\"XX\",VLOOKUP(\"WRONG\",Answers!M:N,2,FALSE),AC47)+AD47)","v":""},{"$f":"Mainframe!J46","v":0},{"$f":"IF(AF47=0,\"\",IF(NOT(ISNA(VLOOKUP(AF47,Answers!O:P,2,FALSE))),VLOOKUP(AF47,Answers!O:P,2,FALSE),\"Help!\"))","v":""},null,{"$f":"IF(AG47=\"\",\"\",AE47+IF(AG47=\"XX\",VLOOKUP(\"WRONG\",Answers!O:P,2,FALSE),AG47)+AH47)","v":""},{"$f":"Mainframe!K46","v":0},{"$f":"IF(AJ47=0,\"\",IF(NOT(ISNA(VLOOKUP(AJ47,Answers!Q:R,2,FALSE))),VLOOKUP(AJ47,Answers!Q:R,2,FALSE),\"Help!\"))","v":""},null,{"$f":"IF(AK47=\"\",\"\",AI47+IF(AK47=\"XX\",VLOOKUP(\"WRONG\",Answers!Q:R,2,FALSE),AK47)+AL47)","v":""},{"$f":"Mainframe!L46","v":0},{"$f":"IF(AN47=0,\"\",IF(NOT(ISNA(VLOOKUP(AN47,Answers!S:T,2,FALSE))),VLOOKUP(AN47,Answers!S:T,2,FALSE),\"Help!\"))","v":""},null,{"$f":"IF(AO47=\"\",\"\",AM47+IF(AO47=\"XX\",VLOOKUP(\"WRONG\",Answers!S:T,2,FALSE),AO47)+AP47)","v":""},{"$f":"Mainframe!M46","v":0},{"$f":"IF(AR47=0,\"\",IF(NOT(ISNA(VLOOKUP(AR47,Answers!U:V,2,FALSE))),VLOOKUP(AR47,Answers!U:V,2,FALSE),\"Help!\"))","v":""},null,{"$f":"IF(AS47=\"\",\"\",AQ47+IF(AS47=\"XX\",VLOOKUP(\"WRONG\",Answers!U:V,2,FALSE),AS47)+AT47)","v":""},{"$f":"Mainframe!N46","v":0},{"$f":"IF(AV47=0,\"\",IF(NOT(ISNA(VLOOKUP(AV47,Answers!W:X,2,FALSE))),VLOOKUP(AV47,Answers!W:X,2,FALSE),\"Help!\"))","v":""},null,{"$f":"IF(AW47=\"\",\"\",AU47+IF(AW47=\"XX\",VLOOKUP(\"WRONG\",Answers!W:X,2,FALSE),AW47)+AX47)","v":""},{"$f":"Mainframe!O46","v":0},{"$f":"IF(AZ47=0,\"\",IF(NOT(ISNA(VLOOKUP(AZ47,Answers!Y:Z,2,FALSE))),VLOOKUP(AZ47,Answers!Y:Z,2,FALSE),\"Help!\"))","v":""},null,{"$f":"IF(BA47=\"\",\"\",AY47+IF(BA47=\"XX\",VLOOKUP(\"WRONG\",Answers!Y:Z,2,FALSE),BA47)+BB47)","v":""},{"$f":"Mainframe!P46","v":0},{"$f":"IF(BD47=0,\"\",IF(NOT(ISNA(VLOOKUP(BD47,Answers!AA:AB,2,FALSE))),VLOOKUP(BD47,Answers!AA:AB,2,FALSE),\"Help!\"))","v":""},null,{"$f":"IF(BE47=\"\",\"\",BC47+IF(BE47=\"XX\",VLOOKUP(\"WRONG\",Answers!AA:AB,2,FALSE),BE47)+BF47)","v":""},{"$f":"Mainframe!Q46","v":0},{"$f":"IF(BH47=0,\"\",IF(NOT(ISNA(VLOOKUP(BH47,Answers!AC:AD,2,FALSE))),VLOOKUP(BH47,Answers!AC:AD,2,FALSE),\"Help!\"))","v":""},null,{"$f":"IF(BI47=\"\",\"\",BG47+IF(BI47=\"XX\",VLOOKUP(\"WRONG\",Answers!AC:AD,2,FALSE),BI47)+BJ47)","v":""},{"$f":"Mainframe!R46","v":0},{"$f":"IF(BL47=0,\"\",IF(NOT(ISNA(VLOOKUP(BL47,Answers!AE:AF,2,FALSE))),VLOOKUP(BL47,Answers!AE:AF,2,FALSE),\"Help!\"))","v":""},null,{"$f":"IF(BM47=\"\",\"\",BK47+IF(BM47=\"XX\",VLOOKUP(\"WRONG\",Answers!AE:AF,2,FALSE),BM47)+BN47)","v":""},{"$f":"Mainframe!S46","v":0},{"$f":"IF(BP47=0,\"\",IF(NOT(ISNA(VLOOKUP(BP47,Answers!AG:AH,2,FALSE))),VLOOKUP(BP47,Answers!AG:AH,2,FALSE),\"Help!\"))","v":""},null,{"$f":"IF(BQ47=\"\",\"\",BO47+IF(BQ47=\"XX\",VLOOKUP(\"WRONG\",Answers!AG:AH,2,FALSE),BQ47)+BR47)","v":""},{"$f":"Mainframe!T46","v":0},{"$f":"IF(BT47=0,\"\",IF(NOT(ISNA(VLOOKUP(BT47,Answers!AI:AJ,2,FALSE))),VLOOKUP(BT47,Answers!AI:AJ,2,FALSE),\"Help!\"))","v":""},null,{"$f":"IF(BU47=\"\",\"\",BS47+IF(BU47=\"XX\",VLOOKUP(\"WRONG\",Answers!AI:AJ,2,FALSE),BU47)+BV47)","v":""},{"$f":"Mainframe!U46","v":0},{"$f":"IF(BX47=0,\"\",IF(NOT(ISNA(VLOOKUP(BX47,Answers!AK:AL,2,FALSE))),VLOOKUP(BX47,Answers!AK:AL,2,FALSE),\"Help!\"))","v":""},null,{"$f":"IF(BY47=\"\",\"\",BW47+IF(BY47=\"XX\",VLOOKUP(\"WRONG\",Answers!AK:AL,2,FALSE),BY47)+BZ47)","v":""},{"$f":"Mainframe!V46","v":0},{"$f":"IF(CB47=0,\"\",IF(NOT(ISNA(VLOOKUP(CB47,Answers!AM:AN,2,FALSE))),VLOOKUP(CB47,Answers!AM:AN,2,FALSE),\"Help!\"))","v":""},null,{"$f":"IF(CC47=\"\",\"\",CA47+IF(CC47=\"XX\",VLOOKUP(\"WRONG\",Answers!AM:AN,2,FALSE),CC47)+CD47)","v":""},null,null,"","","","",""]
["[*]",{"$f":"Mainframe!B47","v":0},46,{"$f":"Mainframe!C47","v":0},{"$f":"IF(D48=0,\"\",IF(NOT(ISNA(VLOOKUP(D48,Answers!A:B,2,FALSE))),VLOOKUP(D48,Answers!A:B,2,FALSE),\"Help!\"))","v":""},null,{"$f":"IF(E48=\"\",\"\",IF(E48=\"XX\",VLOOKUP(\"WRONG\",Answers!A:B,2,FALSE),E48)+F48)","v":""},{"$f":"Mainframe!D47","v":0},{"$f":"IF(H48=0,\"\",IF(NOT(ISNA(VLOOKUP(H48,Answers!C:D,2,FALSE))),VLOOKUP(H48,Answers!C:D,2,FALSE),\"Help!\"))","v":""},null,{"$f":"IF(I48=\"\",\"\",G48+IF(I48=\"XX\",VLOOKUP(\"WRONG\",Answers!C:D,2,FALSE),I48)+J48)","v":""},{"$f":"Mainframe!E47","v":0},{"$f":"IF(L48=0,\"\",IF(NOT(ISNA(VLOOKUP(L48,Answers!E:F,2,FALSE))),VLOOKUP(L48,Answers!E:F,2,FALSE),\"Help!\"))","v":""},null,{"$f":"IF(M48=\"\",\"\",K48+IF(M48=\"XX\",VLOOKUP(\"WRONG\",Answers!E:F,2,FALSE),M48)+N48)","v":""},{"$f":"Mainframe!F47","v":0},{"$f":"IF(P48=0,\"\",IF(NOT(ISNA(VLOOKUP(P48,Answers!G:H,2,FALSE))),VLOOKUP(P48,Answers!G:H,2,FALSE),\"Help!\"))","v":""},null,{"$f":"IF(Q48=\"\",\"\",O48+IF(Q48=\"XX\",VLOOKUP(\"WRONG\",Answers!G:H,2,FALSE),Q48)+R48)","v":""},{"$f":"Mainframe!G47","v":0},{"$f":"IF(T48=0,\"\",IF(NOT(ISNA(VLOOKUP(T48,Answers!I:J,2,FALSE))),VLOOKUP(T48,Answers!I:J,2,FALSE),\"Help!\"))","v":""},null,{"$f":"IF(U48=\"\",\"\",S48+IF(U48=\"XX\",VLOOKUP(\"WRONG\",Answers!I:J,2,FALSE),U48)+V48)","v":""},{"$f":"Mainframe!H47","v":0},{"$f":"IF(X48=0,\"\",IF(NOT(ISNA(VLOOKUP(X48,Answers!K:L,2,FALSE))),VLOOKUP(X48,Answers!K:L,2,FALSE),\"Help!\"))","v":""},null,{"$f":"IF(Y48=\"\",\"\",W48+IF(Y48=\"XX\",VLOOKUP(\"WRONG\",Answers!K:L,2,FALSE),Y48)+Z48)","v":""},{"$f":"Mainframe!I47","v":0},{"$f":"IF(AB48=0,\"\",IF(NOT(ISNA(VLOOKUP(AB48,Answers!M:N,2,FALSE))),VLOOKUP(AB48,Answers!M:N,2,FALSE),\"Help!\"))","v":""},null,{"$f":"IF(AC48=\"\",\"\",AA48+IF(AC48=\"XX\",VLOOKUP(\"WRONG\",Answers!M:N,2,FALSE),AC48)+AD48)","v":""},{"$f":"Mainframe!J47","v":0},{"$f":"IF(AF48=0,\"\",IF(NOT(ISNA(VLOOKUP(AF48,Answers!O:P,2,FALSE))),VLOOKUP(AF48,Answers!O:P,2,FALSE),\"Help!\"))","v":""},null,{"$f":"IF(AG48=\"\",\"\",AE48+IF(AG48=\"XX\",VLOOKUP(\"WRONG\",Answers!O:P,2,FALSE),AG48)+AH48)","v":""},{"$f":"Mainframe!K47","v":0},{"$f":"IF(AJ48=0,\"\",IF(NOT(ISNA(VLOOKUP(AJ48,Answers!Q:R,2,FALSE))),VLOOKUP(AJ48,Answers!Q:R,2,FALSE),\"Help!\"))","v":""},null,{"$f":"IF(AK48=\"\",\"\",AI48+IF(AK48=\"XX\",VLOOKUP(\"WRONG\",Answers!Q:R,2,FALSE),AK48)+AL48)","v":""},{"$f":"Mainframe!L47","v":0},{"$f":"IF(AN48=0,\"\",IF(NOT(ISNA(VLOOKUP(AN48,Answers!S:T,2,FALSE))),VLOOKUP(AN48,Answers!S:T,2,FALSE),\"Help!\"))","v":""},null,{"$f":"IF(AO48=\"\",\"\",AM48+IF(AO48=\"XX\",VLOOKUP(\"WRONG\",Answers!S:T,2,FALSE),AO48)+AP48)","v":""},{"$f":"Mainframe!M47","v":0},{"$f":"IF(AR48=0,\"\",IF(NOT(ISNA(VLOOKUP(AR48,Answers!U:V,2,FALSE))),VLOOKUP(AR48,Answers!U:V,2,FALSE),\"Help!\"))","v":""},null,{"$f":"IF(AS48=\"\",\"\",AQ48+IF(AS48=\"XX\",VLOOKUP(\"WRONG\",Answers!U:V,2,FALSE),AS48)+AT48)","v":""},{"$f":"Mainframe!N47","v":0},{"$f":"IF(AV48=0,\"\",IF(NOT(ISNA(VLOOKUP(AV48,Answers!W:X,2,FALSE))),VLOOKUP(AV48,Answers!W:X,2,FALSE),\"Help!\"))","v":""},null,{"$f":"IF(AW48=\"\",\"\",AU48+IF(AW48=\"XX\",VLOOKUP(\"WRONG\",Answers!W:X,2,FALSE),AW48)+AX48)","v":""},{"$f":"Mainframe!O47","v":0},{"$f":"IF(AZ48=0,\"\",IF(NOT(ISNA(VLOOKUP(AZ48,Answers!Y:Z,2,FALSE))),VLOOKUP(AZ48,Answers!Y:Z,2,FALSE),\"Help!\"))","v":""},null,{"$f":"IF(BA48=\"\",\"\",AY48+IF(BA48=\"XX\",VLOOKUP(\"WRONG\",Answers!Y:Z,2,FALSE),BA48)+BB48)","v":""},{"$f":"Mainframe!P47","v":0},{"$f":"IF(BD48=0,\"\",IF(NOT(ISNA(VLOOKUP(BD48,Answers!AA:AB,2,FALSE))),VLOOKUP(BD48,Answers!AA:AB,2,FALSE),\"Help!\"))","v":""},null,{"$f":"IF(BE48=\"\",\"\",BC48+IF(BE48=\"XX\",VLOOKUP(\"WRONG\",Answers!AA:AB,2,FALSE),BE48)+BF48)","v":""},{"$f":"Mainframe!Q47","v":0},{"$f":"IF(BH48=0,\"\",IF(NOT(ISNA(VLOOKUP(BH48,Answers!AC:AD,2,FALSE))),VLOOKUP(BH48,Answers!AC:AD,2,FALSE),\"Help!\"))","v":""},null,{"$f":"IF(BI48=\"\",\"\",BG48+IF(BI48=\"XX\",VLOOKUP(\"WRONG\",Answers!AC:AD,2,FALSE),BI48)+BJ48)","v":""},{"$f":"Mainframe!R47","v":0},{"$f":"IF(BL48=0,\"\",IF(NOT(ISNA(VLOOKUP(BL48,Answers!AE:AF,2,FALSE))),VLOOKUP(BL48,Answers!AE:AF,2,FALSE),\"Help!\"))","v":""},null,{"$f":"IF(BM48=\"\",\"\",BK48+IF(BM48=\"XX\",VLOOKUP(\"WRONG\",Answers!AE:AF,2,FALSE),BM48)+BN48)","v":""},{"$f":"Mainframe!S47","v":0},{"$f":"IF(BP48=0,\"\",IF(NOT(ISNA(VLOOKUP(BP48,Answers!AG:AH,2,FALSE))),VLOOKUP(BP48,Answers!AG:AH,2,FALSE),\"Help!\"))","v":""},null,{"$f":"IF(BQ48=\"\",\"\",BO48+IF(BQ48=\"XX\",VLOOKUP(\"WRONG\",Answers!AG:AH,2,FALSE),BQ48)+BR48)","v":""},{"$f":"Mainframe!T47","v":0},{"$f":"IF(BT48=0,\"\",IF(NOT(ISNA(VLOOKUP(BT48,Answers!AI:AJ,2,FALSE))),VLOOKUP(BT48,Answers!AI:AJ,2,FALSE),\"Help!\"))","v":""},null,{"$f":"IF(BU48=\"\",\"\",BS48+IF(BU48=\"XX\",VLOOKUP(\"WRONG\",Answers!AI:AJ,2,FALSE),BU48)+BV48)","v":""},{"$f":"Mainframe!U47","v":0},{"$f":"IF(BX48=0,\"\",IF(NOT(ISNA(VLOOKUP(BX48,Answers!AK:AL,2,FALSE))),VLOOKUP(BX48,Answers!AK:AL,2,FALSE),\"Help!\"))","v":""},null,{"$f":"IF(BY48=\"\",\"\",BW48+IF(BY48=\"XX\",VLOOKUP(\"WRONG\",Answers!AK:AL,2,FALSE),BY48)+BZ48)","v":""},{"$f":"Mainframe!V47","v":0},{"$f":"IF(CB48=0,\"\",IF(NOT(ISNA(VLOOKUP(CB48,Answers!AM:AN,2,FALSE))),VLOOKUP(CB48,Answers!AM:AN,2,FALSE),\"Help!\"))","v":""},null,{"$f":"IF(CC48=\"\",\"\",CA48+IF(CC48=\"XX\",VLOOKUP(\"WRONG\",Answers!AM:AN,2,FALSE),CC48)+CD48)","v":""},null,null,"","","","",""]
["[*]",{"$f":"Mainframe!B48","v":0},47,{"$f":"Mainframe!C48","v":0},{"$f":"IF(D49=0,\"\",IF(NOT(ISNA(VLOOKUP(D49,Answers!A:B,2,FALSE))),VLOOKUP(D49,Answers!A:B,2,FALSE),\"Help!\"))","v":""},null,{"$f":"IF(E49=\"\",\"\",IF(E49=\"XX\",VLOOKUP(\"WRONG\",Answers!A:B,2,FALSE),E49)+F49)","v":""},{"$f":"Mainframe!D48","v":0},{"$f":"IF(H49=0,\"\",IF(NOT(ISNA(VLOOKUP(H49,Answers!C:D,2,FALSE))),VLOOKUP(H49,Answers!C:D,2,FALSE),\"Help!\"))","v":""},null,{"$f":"IF(I49=\"\",\"\",G49+IF(I49=\"XX\",VLOOKUP(\"WRONG\",Answers!C:D,2,FALSE),I49)+J49)","v":""},{"$f":"Mainframe!E48","v":0},{"$f":"IF(L49=0,\"\",IF(NOT(ISNA(VLOOKUP(L49,Answers!E:F,2,FALSE))),VLOOKUP(L49,Answers!E:F,2,FALSE),\"Help!\"))","v":""},null,{"$f":"IF(M49=\"\",\"\",K49+IF(M49=\"XX\",VLOOKUP(\"WRONG\",Answers!E:F,2,FALSE),M49)+N49)","v":""},{"$f":"Mainframe!F48","v":0},{"$f":"IF(P49=0,\"\",IF(NOT(ISNA(VLOOKUP(P49,Answers!G:H,2,FALSE))),VLOOKUP(P49,Answers!G:H,2,FALSE),\"Help!\"))","v":""},null,{"$f":"IF(Q49=\"\",\"\",O49+IF(Q49=\"XX\",VLOOKUP(\"WRONG\",Answers!G:H,2,FALSE),Q49)+R49)","v":""},{"$f":"Mainframe!G48","v":0},{"$f":"IF(T49=0,\"\",IF(NOT(ISNA(VLOOKUP(T49,Answers!I:J,2,FALSE))),VLOOKUP(T49,Answers!I:J,2,FALSE),\"Help!\"))","v":""},null,{"$f":"IF(U49=\"\",\"\",S49+IF(U49=\"XX\",VLOOKUP(\"WRONG\",Answers!I:J,2,FALSE),U49)+V49)","v":""},{"$f":"Mainframe!H48","v":0},{"$f":"IF(X49=0,\"\",IF(NOT(ISNA(VLOOKUP(X49,Answers!K:L,2,FALSE))),VLOOKUP(X49,Answers!K:L,2,FALSE),\"Help!\"))","v":""},null,{"$f":"IF(Y49=\"\",\"\",W49+IF(Y49=\"XX\",VLOOKUP(\"WRONG\",Answers!K:L,2,FALSE),Y49)+Z49)","v":""},{"$f":"Mainframe!I48","v":0},{"$f":"IF(AB49=0,\"\",IF(NOT(ISNA(VLOOKUP(AB49,Answers!M:N,2,FALSE))),VLOOKUP(AB49,Answers!M:N,2,FALSE),\"Help!\"))","v":""},null,{"$f":"IF(AC49=\"\",\"\",AA49+IF(AC49=\"XX\",VLOOKUP(\"WRONG\",Answers!M:N,2,FALSE),AC49)+AD49)","v":""},{"$f":"Mainframe!J48","v":0},{"$f":"IF(AF49=0,\"\",IF(NOT(ISNA(VLOOKUP(AF49,Answers!O:P,2,FALSE))),VLOOKUP(AF49,Answers!O:P,2,FALSE),\"Help!\"))","v":""},null,{"$f":"IF(AG49=\"\",\"\",AE49+IF(AG49=\"XX\",VLOOKUP(\"WRONG\",Answers!O:P,2,FALSE),AG49)+AH49)","v":""},{"$f":"Mainframe!K48","v":0},{"$f":"IF(AJ49=0,\"\",IF(NOT(ISNA(VLOOKUP(AJ49,Answers!Q:R,2,FALSE))),VLOOKUP(AJ49,Answers!Q:R,2,FALSE),\"Help!\"))","v":""},null,{"$f":"IF(AK49=\"\",\"\",AI49+IF(AK49=\"XX\",VLOOKUP(\"WRONG\",Answers!Q:R,2,FALSE),AK49)+AL49)","v":""},{"$f":"Mainframe!L48","v":0},{"$f":"IF(AN49=0,\"\",IF(NOT(ISNA(VLOOKUP(AN49,Answers!S:T,2,FALSE))),VLOOKUP(AN49,Answers!S:T,2,FALSE),\"Help!\"))","v":""},null,{"$f":"IF(AO49=\"\",\"\",AM49+IF(AO49=\"XX\",VLOOKUP(\"WRONG\",Answers!S:T,2,FALSE),AO49)+AP49)","v":""},{"$f":"Mainframe!M48","v":0},{"$f":"IF(AR49=0,\"\",IF(NOT(ISNA(VLOOKUP(AR49,Answers!U:V,2,FALSE))),VLOOKUP(AR49,Answers!U:V,2,FALSE),\"Help!\"))","v":""},null,{"$f":"IF(AS49=\"\",\"\",AQ49+IF(AS49=\"XX\",VLOOKUP(\"WRONG\",Answers!U:V,2,FALSE),AS49)+AT49)","v":""},{"$f":"Mainframe!N48","v":0},{"$f":"IF(AV49=0,\"\",IF(NOT(ISNA(VLOOKUP(AV49,Answers!W:X,2,FALSE))),VLOOKUP(AV49,Answers!W:X,2,FALSE),\"Help!\"))","v":""},null,{"$f":"IF(AW49=\"\",\"\",AU49+IF(AW49=\"XX\",VLOOKUP(\"WRONG\",Answers!W:X,2,FALSE),AW49)+AX49)","v":""},{"$f":"Mainframe!O48","v":0},{"$f":"IF(AZ49=0,\"\",IF(NOT(ISNA(VLOOKUP(AZ49,Answers!Y:Z,2,FALSE))),VLOOKUP(AZ49,Answers!Y:Z,2,FALSE),\"Help!\"))","v":""},null,{"$f":"IF(BA49=\"\",\"\",AY49+IF(BA49=\"XX\",VLOOKUP(\"WRONG\",Answers!Y:Z,2,FALSE),BA49)+BB49)","v":""},{"$f":"Mainframe!P48","v":0},{"$f":"IF(BD49=0,\"\",IF(NOT(ISNA(VLOOKUP(BD49,Answers!AA:AB,2,FALSE))),VLOOKUP(BD49,Answers!AA:AB,2,FALSE),\"Help!\"))","v":""},null,{"$f":"IF(BE49=\"\",\"\",BC49+IF(BE49=\"XX\",VLOOKUP(\"WRONG\",Answers!AA:AB,2,FALSE),BE49)+BF49)","v":""},{"$f":"Mainframe!Q48","v":0},{"$f":"IF(BH49=0,\"\",IF(NOT(ISNA(VLOOKUP(BH49,Answers!AC:AD,2,FALSE))),VLOOKUP(BH49,Answers!AC:AD,2,FALSE),\"Help!\"))","v":""},null,{"$f":"IF(BI49=\"\",\"\",BG49+IF(BI49=\"XX\",VLOOKUP(\"WRONG\",Answers!AC:AD,2,FALSE),BI49)+BJ49)","v":""},{"$f":"Mainframe!R48","v":0},{"$f":"IF(BL49=0,\"\",IF(NOT(ISNA(VLOOKUP(BL49,Answers!AE:AF,2,FALSE))),VLOOKUP(BL49,Answers!AE:AF,2,FALSE),\"Help!\"))","v":""},null,{"$f":"IF(BM49=\"\",\"\",BK49+IF(BM49=\"XX\",VLOOKUP(\"WRONG\",Answers!AE:AF,2,FALSE),BM49)+BN49)","v":""},{"$f":"Mainframe!S48","v":0},{"$f":"IF(BP49=0,\"\",IF(NOT(ISNA(VLOOKUP(BP49,Answers!AG:AH,2,FALSE))),VLOOKUP(BP49,Answers!AG:AH,2,FALSE),\"Help!\"))","v":""},null,{"$f":"IF(BQ49=\"\",\"\",BO49+IF(BQ49=\"XX\",VLOOKUP(\"WRONG\",Answers!AG:AH,2,FALSE),BQ49)+BR49)","v":""},{"$f":"Mainframe!T48","v":0},{"$f":"IF(BT49=0,\"\",IF(NOT(ISNA(VLOOKUP(BT49,Answers!AI:AJ,2,FALSE))),VLOOKUP(BT49,Answers!AI:AJ,2,FALSE),\"Help!\"))","v":""},null,{"$f":"IF(BU49=\"\",\"\",BS49+IF(BU49=\"XX\",VLOOKUP(\"WRONG\",Answers!AI:AJ,2,FALSE),BU49)+BV49)","v":""},{"$f":"Mainframe!U48","v":0},{"$f":"IF(BX49=0,\"\",IF(NOT(ISNA(VLOOKUP(BX49,Answers!AK:AL,2,FALSE))),VLOOKUP(BX49,Answers!AK:AL,2,FALSE),\"Help!\"))","v":""},null,{"$f":"IF(BY49=\"\",\"\",BW49+IF(BY49=\"XX\",VLOOKUP(\"WRONG\",Answers!AK:AL,2,FALSE),BY49)+BZ49)","v":""},{"$f":"Mainframe!V48","v":0},{"$f":"IF(CB49=0,\"\",IF(NOT(ISNA(VLOOKUP(CB49,Answers!AM:AN,2,FALSE))),VLOOKUP(CB49,Answers!AM:AN,2,FALSE),\"Help!\"))","v":""},null,{"$f":"IF(CC49=\"\",\"\",CA49+IF(CC49=\"XX\",VLOOKUP(\"WRONG\",Answers!AM:AN,2,FALSE),CC49)+CD49)","v":""},null,null,"","","","",""]
["[*]",{"$f":"Mainframe!B49","v":0},48,{"$f":"Mainframe!C49","v":0},{"$f":"IF(D50=0,\"\",IF(NOT(ISNA(VLOOKUP(D50,Answers!A:B,2,FALSE))),VLOOKUP(D50,Answers!A:B,2,FALSE),\"Help!\"))","v":""},null,{"$f":"IF(E50=\"\",\"\",IF(E50=\"XX\",VLOOKUP(\"WRONG\",Answers!A:B,2,FALSE),E50)+F50)","v":""},{"$f":"Mainframe!D49","v":0},{"$f":"IF(H50=0,\"\",IF(NOT(ISNA(VLOOKUP(H50,Answers!C:D,2,FALSE))),VLOOKUP(H50,Answers!C:D,2,FALSE),\"Help!\"))","v":""},null,{"$f":"IF(I50=\"\",\"\",G50+IF(I50=\"XX\",VLOOKUP(\"WRONG\",Answers!C:D,2,FALSE),I50)+J50)","v":""},{"$f":"Mainframe!E49","v":0},{"$f":"IF(L50=0,\"\",IF(NOT(ISNA(VLOOKUP(L50,Answers!E:F,2,FALSE))),VLOOKUP(L50,Answers!E:F,2,FALSE),\"Help!\"))","v":""},null,{"$f":"IF(M50=\"\",\"\",K50+IF(M50=\"XX\",VLOOKUP(\"WRONG\",Answers!E:F,2,FALSE),M50)+N50)","v":""},{"$f":"Mainframe!F49","v":0},{"$f":"IF(P50=0,\"\",IF(NOT(ISNA(VLOOKUP(P50,Answers!G:H,2,FALSE))),VLOOKUP(P50,Answers!G:H,2,FALSE),\"Help!\"))","v":""},null,{"$f":"IF(Q50=\"\",\"\",O50+IF(Q50=\"XX\",VLOOKUP(\"WRONG\",Answers!G:H,2,FALSE),Q50)+R50)","v":""},{"$f":"Mainframe!G49","v":0},{"$f":"IF(T50=0,\"\",IF(NOT(ISNA(VLOOKUP(T50,Answers!I:J,2,FALSE))),VLOOKUP(T50,Answers!I:J,2,FALSE),\"Help!\"))","v":""},null,{"$f":"IF(U50=\"\",\"\",S50+IF(U50=\"XX\",VLOOKUP(\"WRONG\",Answers!I:J,2,FALSE),U50)+V50)","v":""},{"$f":"Mainframe!H49","v":0},{"$f":"IF(X50=0,\"\",IF(NOT(ISNA(VLOOKUP(X50,Answers!K:L,2,FALSE))),VLOOKUP(X50,Answers!K:L,2,FALSE),\"Help!\"))","v":""},null,{"$f":"IF(Y50=\"\",\"\",W50+IF(Y50=\"XX\",VLOOKUP(\"WRONG\",Answers!K:L,2,FALSE),Y50)+Z50)","v":""},{"$f":"Mainframe!I49","v":0},{"$f":"IF(AB50=0,\"\",IF(NOT(ISNA(VLOOKUP(AB50,Answers!M:N,2,FALSE))),VLOOKUP(AB50,Answers!M:N,2,FALSE),\"Help!\"))","v":""},null,{"$f":"IF(AC50=\"\",\"\",AA50+IF(AC50=\"XX\",VLOOKUP(\"WRONG\",Answers!M:N,2,FALSE),AC50)+AD50)","v":""},{"$f":"Mainframe!J49","v":0},{"$f":"IF(AF50=0,\"\",IF(NOT(ISNA(VLOOKUP(AF50,Answers!O:P,2,FALSE))),VLOOKUP(AF50,Answers!O:P,2,FALSE),\"Help!\"))","v":""},null,{"$f":"IF(AG50=\"\",\"\",AE50+IF(AG50=\"XX\",VLOOKUP(\"WRONG\",Answers!O:P,2,FALSE),AG50)+AH50)","v":""},{"$f":"Mainframe!K49","v":0},{"$f":"IF(AJ50=0,\"\",IF(NOT(ISNA(VLOOKUP(AJ50,Answers!Q:R,2,FALSE))),VLOOKUP(AJ50,Answers!Q:R,2,FALSE),\"Help!\"))","v":""},null,{"$f":"IF(AK50=\"\",\"\",AI50+IF(AK50=\"XX\",VLOOKUP(\"WRONG\",Answers!Q:R,2,FALSE),AK50)+AL50)","v":""},{"$f":"Mainframe!L49","v":0},{"$f":"IF(AN50=0,\"\",IF(NOT(ISNA(VLOOKUP(AN50,Answers!S:T,2,FALSE))),VLOOKUP(AN50,Answers!S:T,2,FALSE),\"Help!\"))","v":""},null,{"$f":"IF(AO50=\"\",\"\",AM50+IF(AO50=\"XX\",VLOOKUP(\"WRONG\",Answers!S:T,2,FALSE),AO50)+AP50)","v":""},{"$f":"Mainframe!M49","v":0},{"$f":"IF(AR50=0,\"\",IF(NOT(ISNA(VLOOKUP(AR50,Answers!U:V,2,FALSE))),VLOOKUP(AR50,Answers!U:V,2,FALSE),\"Help!\"))","v":""},null,{"$f":"IF(AS50=\"\",\"\",AQ50+IF(AS50=\"XX\",VLOOKUP(\"WRONG\",Answers!U:V,2,FALSE),AS50)+AT50)","v":""},{"$f":"Mainframe!N49","v":0},{"$f":"IF(AV50=0,\"\",IF(NOT(ISNA(VLOOKUP(AV50,Answers!W:X,2,FALSE))),VLOOKUP(AV50,Answers!W:X,2,FALSE),\"Help!\"))","v":""},null,{"$f":"IF(AW50=\"\",\"\",AU50+IF(AW50=\"XX\",VLOOKUP(\"WRONG\",Answers!W:X,2,FALSE),AW50)+AX50)","v":""},{"$f":"Mainframe!O49","v":0},{"$f":"IF(AZ50=0,\"\",IF(NOT(ISNA(VLOOKUP(AZ50,Answers!Y:Z,2,FALSE))),VLOOKUP(AZ50,Answers!Y:Z,2,FALSE),\"Help!\"))","v":""},null,{"$f":"IF(BA50=\"\",\"\",AY50+IF(BA50=\"XX\",VLOOKUP(\"WRONG\",Answers!Y:Z,2,FALSE),BA50)+BB50)","v":""},{"$f":"Mainframe!P49","v":0},{"$f":"IF(BD50=0,\"\",IF(NOT(ISNA(VLOOKUP(BD50,Answers!AA:AB,2,FALSE))),VLOOKUP(BD50,Answers!AA:AB,2,FALSE),\"Help!\"))","v":""},null,{"$f":"IF(BE50=\"\",\"\",BC50+IF(BE50=\"XX\",VLOOKUP(\"WRONG\",Answers!AA:AB,2,FALSE),BE50)+BF50)","v":""},{"$f":"Mainframe!Q49","v":0},{"$f":"IF(BH50=0,\"\",IF(NOT(ISNA(VLOOKUP(BH50,Answers!AC:AD,2,FALSE))),VLOOKUP(BH50,Answers!AC:AD,2,FALSE),\"Help!\"))","v":""},null,{"$f":"IF(BI50=\"\",\"\",BG50+IF(BI50=\"XX\",VLOOKUP(\"WRONG\",Answers!AC:AD,2,FALSE),BI50)+BJ50)","v":""},{"$f":"Mainframe!R49","v":0},{"$f":"IF(BL50=0,\"\",IF(NOT(ISNA(VLOOKUP(BL50,Answers!AE:AF,2,FALSE))),VLOOKUP(BL50,Answers!AE:AF,2,FALSE),\"Help!\"))","v":""},null,{"$f":"IF(BM50=\"\",\"\",BK50+IF(BM50=\"XX\",VLOOKUP(\"WRONG\",Answers!AE:AF,2,FALSE),BM50)+BN50)","v":""},{"$f":"Mainframe!S49","v":0},{"$f":"IF(BP50=0,\"\",IF(NOT(ISNA(VLOOKUP(BP50,Answers!AG:AH,2,FALSE))),VLOOKUP(BP50,Answers!AG:AH,2,FALSE),\"Help!\"))","v":""},null,{"$f":"IF(BQ50=\"\",\"\",BO50+IF(BQ50=\"XX\",VLOOKUP(\"WRONG\",Answers!AG:AH,2,FALSE),BQ50)+BR50)","v":""},{"$f":"Mainframe!T49","v":0},{"$f":"IF(BT50=0,\"\",IF(NOT(ISNA(VLOOKUP(BT50,Answers!AI:AJ,2,FALSE))),VLOOKUP(BT50,Answers!AI:AJ,2,FALSE),\"Help!\"))","v":""},null,{"$f":"IF(BU50=\"\",\"\",BS50+IF(BU50=\"XX\",VLOOKUP(\"WRONG\",Answers!AI:AJ,2,FALSE),BU50)+BV50)","v":""},{"$f":"Mainframe!U49","v":0},{"$f":"IF(BX50=0,\"\",IF(NOT(ISNA(VLOOKUP(BX50,Answers!AK:AL,2,FALSE))),VLOOKUP(BX50,Answers!AK:AL,2,FALSE),\"Help!\"))","v":""},null,{"$f":"IF(BY50=\"\",\"\",BW50+IF(BY50=\"XX\",VLOOKUP(\"WRONG\",Answers!AK:AL,2,FALSE),BY50)+BZ50)","v":""},{"$f":"Mainframe!V49","v":0},{"$f":"IF(CB50=0,\"\",IF(NOT(ISNA(VLOOKUP(CB50,Answers!AM:AN,2,FALSE))),VLOOKUP(CB50,Answers!AM:AN,2,FALSE),\"Help!\"))","v":""},null,{"$f":"IF(CC50=\"\",\"\",CA50+IF(CC50=\"XX\",VLOOKUP(\"WRONG\",Answers!AM:AN,2,FALSE),CC50)+CD50)","v":""},null,null,"","","","",""]
["[*]",{"$f":"Mainframe!B50","v":0},49,{"$f":"Mainframe!C50","v":0},{"$f":"IF(D51=0,\"\",IF(NOT(ISNA(VLOOKUP(D51,Answers!A:B,2,FALSE))),VLOOKUP(D51,Answers!A:B,2,FALSE),\"Help!\"))","v":""},null,{"$f":"IF(E51=\"\",\"\",IF(E51=\"XX\",VLOOKUP(\"WRONG\",Answers!A:B,2,FALSE),E51)+F51)","v":""},{"$f":"Mainframe!D50","v":0},{"$f":"IF(H51=0,\"\",IF(NOT(ISNA(VLOOKUP(H51,Answers!C:D,2,FALSE))),VLOOKUP(H51,Answers!C:D,2,FALSE),\"Help!\"))","v":""},null,{"$f":"IF(I51=\"\",\"\",G51+IF(I51=\"XX\",VLOOKUP(\"WRONG\",Answers!C:D,2,FALSE),I51)+J51)","v":""},{"$f":"Mainframe!E50","v":0},{"$f":"IF(L51=0,\"\",IF(NOT(ISNA(VLOOKUP(L51,Answers!E:F,2,FALSE))),VLOOKUP(L51,Answers!E:F,2,FALSE),\"Help!\"))","v":""},null,{"$f":"IF(M51=\"\",\"\",K51+IF(M51=\"XX\",VLOOKUP(\"WRONG\",Answers!E:F,2,FALSE),M51)+N51)","v":""},{"$f":"Mainframe!F50","v":0},{"$f":"IF(P51=0,\"\",IF(NOT(ISNA(VLOOKUP(P51,Answers!G:H,2,FALSE))),VLOOKUP(P51,Answers!G:H,2,FALSE),\"Help!\"))","v":""},null,{"$f":"IF(Q51=\"\",\"\",O51+IF(Q51=\"XX\",VLOOKUP(\"WRONG\",Answers!G:H,2,FALSE),Q51)+R51)","v":""},{"$f":"Mainframe!G50","v":0},{"$f":"IF(T51=0,\"\",IF(NOT(ISNA(VLOOKUP(T51,Answers!I:J,2,FALSE))),VLOOKUP(T51,Answers!I:J,2,FALSE),\"Help!\"))","v":""},null,{"$f":"IF(U51=\"\",\"\",S51+IF(U51=\"XX\",VLOOKUP(\"WRONG\",Answers!I:J,2,FALSE),U51)+V51)","v":""},{"$f":"Mainframe!H50","v":0},{"$f":"IF(X51=0,\"\",IF(NOT(ISNA(VLOOKUP(X51,Answers!K:L,2,FALSE))),VLOOKUP(X51,Answers!K:L,2,FALSE),\"Help!\"))","v":""},null,{"$f":"IF(Y51=\"\",\"\",W51+IF(Y51=\"XX\",VLOOKUP(\"WRONG\",Answers!K:L,2,FALSE),Y51)+Z51)","v":""},{"$f":"Mainframe!I50","v":0},{"$f":"IF(AB51=0,\"\",IF(NOT(ISNA(VLOOKUP(AB51,Answers!M:N,2,FALSE))),VLOOKUP(AB51,Answers!M:N,2,FALSE),\"Help!\"))","v":""},null,{"$f":"IF(AC51=\"\",\"\",AA51+IF(AC51=\"XX\",VLOOKUP(\"WRONG\",Answers!M:N,2,FALSE),AC51)+AD51)","v":""},{"$f":"Mainframe!J50","v":0},{"$f":"IF(AF51=0,\"\",IF(NOT(ISNA(VLOOKUP(AF51,Answers!O:P,2,FALSE))),VLOOKUP(AF51,Answers!O:P,2,FALSE),\"Help!\"))","v":""},null,{"$f":"IF(AG51=\"\",\"\",AE51+IF(AG51=\"XX\",VLOOKUP(\"WRONG\",Answers!O:P,2,FALSE),AG51)+AH51)","v":""},{"$f":"Mainframe!K50","v":0},{"$f":"IF(AJ51=0,\"\",IF(NOT(ISNA(VLOOKUP(AJ51,Answers!Q:R,2,FALSE))),VLOOKUP(AJ51,Answers!Q:R,2,FALSE),\"Help!\"))","v":""},null,{"$f":"IF(AK51=\"\",\"\",AI51+IF(AK51=\"XX\",VLOOKUP(\"WRONG\",Answers!Q:R,2,FALSE),AK51)+AL51)","v":""},{"$f":"Mainframe!L50","v":0},{"$f":"IF(AN51=0,\"\",IF(NOT(ISNA(VLOOKUP(AN51,Answers!S:T,2,FALSE))),VLOOKUP(AN51,Answers!S:T,2,FALSE),\"Help!\"))","v":""},null,{"$f":"IF(AO51=\"\",\"\",AM51+IF(AO51=\"XX\",VLOOKUP(\"WRONG\",Answers!S:T,2,FALSE),AO51)+AP51)","v":""},{"$f":"Mainframe!M50","v":0},{"$f":"IF(AR51=0,\"\",IF(NOT(ISNA(VLOOKUP(AR51,Answers!U:V,2,FALSE))),VLOOKUP(AR51,Answers!U:V,2,FALSE),\"Help!\"))","v":""},null,{"$f":"IF(AS51=\"\",\"\",AQ51+IF(AS51=\"XX\",VLOOKUP(\"WRONG\",Answers!U:V,2,FALSE),AS51)+AT51)","v":""},{"$f":"Mainframe!N50","v":0},{"$f":"IF(AV51=0,\"\",IF(NOT(ISNA(VLOOKUP(AV51,Answers!W:X,2,FALSE))),VLOOKUP(AV51,Answers!W:X,2,FALSE),\"Help!\"))","v":""},null,{"$f":"IF(AW51=\"\",\"\",AU51+IF(AW51=\"XX\",VLOOKUP(\"WRONG\",Answers!W:X,2,FALSE),AW51)+AX51)","v":""},{"$f":"Mainframe!O50","v":0},{"$f":"IF(AZ51=0,\"\",IF(NOT(ISNA(VLOOKUP(AZ51,Answers!Y:Z,2,FALSE))),VLOOKUP(AZ51,Answers!Y:Z,2,FALSE),\"Help!\"))","v":""},null,{"$f":"IF(BA51=\"\",\"\",AY51+IF(BA51=\"XX\",VLOOKUP(\"WRONG\",Answers!Y:Z,2,FALSE),BA51)+BB51)","v":""},{"$f":"Mainframe!P50","v":0},{"$f":"IF(BD51=0,\"\",IF(NOT(ISNA(VLOOKUP(BD51,Answers!AA:AB,2,FALSE))),VLOOKUP(BD51,Answers!AA:AB,2,FALSE),\"Help!\"))","v":""},null,{"$f":"IF(BE51=\"\",\"\",BC51+IF(BE51=\"XX\",VLOOKUP(\"WRONG\",Answers!AA:AB,2,FALSE),BE51)+BF51)","v":""},{"$f":"Mainframe!Q50","v":0},{"$f":"IF(BH51=0,\"\",IF(NOT(ISNA(VLOOKUP(BH51,Answers!AC:AD,2,FALSE))),VLOOKUP(BH51,Answers!AC:AD,2,FALSE),\"Help!\"))","v":""},null,{"$f":"IF(BI51=\"\",\"\",BG51+IF(BI51=\"XX\",VLOOKUP(\"WRONG\",Answers!AC:AD,2,FALSE),BI51)+BJ51)","v":""},{"$f":"Mainframe!R50","v":0},{"$f":"IF(BL51=0,\"\",IF(NOT(ISNA(VLOOKUP(BL51,Answers!AE:AF,2,FALSE))),VLOOKUP(BL51,Answers!AE:AF,2,FALSE),\"Help!\"))","v":""},null,{"$f":"IF(BM51=\"\",\"\",BK51+IF(BM51=\"XX\",VLOOKUP(\"WRONG\",Answers!AE:AF,2,FALSE),BM51)+BN51)","v":""},{"$f":"Mainframe!S50","v":0},{"$f":"IF(BP51=0,\"\",IF(NOT(ISNA(VLOOKUP(BP51,Answers!AG:AH,2,FALSE))),VLOOKUP(BP51,Answers!AG:AH,2,FALSE),\"Help!\"))","v":""},null,{"$f":"IF(BQ51=\"\",\"\",BO51+IF(BQ51=\"XX\",VLOOKUP(\"WRONG\",Answers!AG:AH,2,FALSE),BQ51)+BR51)","v":""},{"$f":"Mainframe!T50","v":0},{"$f":"IF(BT51=0,\"\",IF(NOT(ISNA(VLOOKUP(BT51,Answers!AI:AJ,2,FALSE))),VLOOKUP(BT51,Answers!AI:AJ,2,FALSE),\"Help!\"))","v":""},null,{"$f":"IF(BU51=\"\",\"\",BS51+IF(BU51=\"XX\",VLOOKUP(\"WRONG\",Answers!AI:AJ,2,FALSE),BU51)+BV51)","v":""},{"$f":"Mainframe!U50","v":0},{"$f":"IF(BX51=0,\"\",IF(NOT(ISNA(VLOOKUP(BX51,Answers!AK:AL,2,FALSE))),VLOOKUP(BX51,Answers!AK:AL,2,FALSE),\"Help!\"))","v":""},null,{"$f":"IF(BY51=\"\",\"\",BW51+IF(BY51=\"XX\",VLOOKUP(\"WRONG\",Answers!AK:AL,2,FALSE),BY51)+BZ51)","v":""},{"$f":"Mainframe!V50","v":0},{"$f":"IF(CB51=0,\"\",IF(NOT(ISNA(VLOOKUP(CB51,Answers!AM:AN,2,FALSE))),VLOOKUP(CB51,Answers!AM:AN,2,FALSE),\"Help!\"))","v":""},null,{"$f":"IF(CC51=\"\",\"\",CA51+IF(CC51=\"XX\",VLOOKUP(\"WRONG\",Answers!AM:AN,2,FALSE),CC51)+CD51)","v":""},null,null,"","","","",""]
["[*]",{"$f":"Mainframe!B51","v":0},50,{"$f":"Mainframe!C51","v":0},{"$f":"IF(D52=0,\"\",IF(NOT(ISNA(VLOOKUP(D52,Answers!A:B,2,FALSE))),VLOOKUP(D52,Answers!A:B,2,FALSE),\"Help!\"))","v":""},null,{"$f":"IF(E52=\"\",\"\",IF(E52=\"XX\",VLOOKUP(\"WRONG\",Answers!A:B,2,FALSE),E52)+F52)","v":""},{"$f":"Mainframe!D51","v":0},{"$f":"IF(H52=0,\"\",IF(NOT(ISNA(VLOOKUP(H52,Answers!C:D,2,FALSE))),VLOOKUP(H52,Answers!C:D,2,FALSE),\"Help!\"))","v":""},null,{"$f":"IF(I52=\"\",\"\",G52+IF(I52=\"XX\",VLOOKUP(\"WRONG\",Answers!C:D,2,FALSE),I52)+J52)","v":""},{"$f":"Mainframe!E51","v":0},{"$f":"IF(L52=0,\"\",IF(NOT(ISNA(VLOOKUP(L52,Answers!E:F,2,FALSE))),VLOOKUP(L52,Answers!E:F,2,FALSE),\"Help!\"))","v":""},null,{"$f":"IF(M52=\"\",\"\",K52+IF(M52=\"XX\",VLOOKUP(\"WRONG\",Answers!E:F,2,FALSE),M52)+N52)","v":""},{"$f":"Mainframe!F51","v":0},{"$f":"IF(P52=0,\"\",IF(NOT(ISNA(VLOOKUP(P52,Answers!G:H,2,FALSE))),VLOOKUP(P52,Answers!G:H,2,FALSE),\"Help!\"))","v":""},null,{"$f":"IF(Q52=\"\",\"\",O52+IF(Q52=\"XX\",VLOOKUP(\"WRONG\",Answers!G:H,2,FALSE),Q52)+R52)","v":""},{"$f":"Mainframe!G51","v":0},{"$f":"IF(T52=0,\"\",IF(NOT(ISNA(VLOOKUP(T52,Answers!I:J,2,FALSE))),VLOOKUP(T52,Answers!I:J,2,FALSE),\"Help!\"))","v":""},null,{"$f":"IF(U52=\"\",\"\",S52+IF(U52=\"XX\",VLOOKUP(\"WRONG\",Answers!I:J,2,FALSE),U52)+V52)","v":""},{"$f":"Mainframe!H51","v":0},{"$f":"IF(X52=0,\"\",IF(NOT(ISNA(VLOOKUP(X52,Answers!K:L,2,FALSE))),VLOOKUP(X52,Answers!K:L,2,FALSE),\"Help!\"))","v":""},null,{"$f":"IF(Y52=\"\",\"\",W52+IF(Y52=\"XX\",VLOOKUP(\"WRONG\",Answers!K:L,2,FALSE),Y52)+Z52)","v":""},{"$f":"Mainframe!I51","v":0},{"$f":"IF(AB52=0,\"\",IF(NOT(ISNA(VLOOKUP(AB52,Answers!M:N,2,FALSE))),VLOOKUP(AB52,Answers!M:N,2,FALSE),\"Help!\"))","v":""},null,{"$f":"IF(AC52=\"\",\"\",AA52+IF(AC52=\"XX\",VLOOKUP(\"WRONG\",Answers!M:N,2,FALSE),AC52)+AD52)","v":""},{"$f":"Mainframe!J51","v":0},{"$f":"IF(AF52=0,\"\",IF(NOT(ISNA(VLOOKUP(AF52,Answers!O:P,2,FALSE))),VLOOKUP(AF52,Answers!O:P,2,FALSE),\"Help!\"))","v":""},null,{"$f":"IF(AG52=\"\",\"\",AE52+IF(AG52=\"XX\",VLOOKUP(\"WRONG\",Answers!O:P,2,FALSE),AG52)+AH52)","v":""},{"$f":"Mainframe!K51","v":0},{"$f":"IF(AJ52=0,\"\",IF(NOT(ISNA(VLOOKUP(AJ52,Answers!Q:R,2,FALSE))),VLOOKUP(AJ52,Answers!Q:R,2,FALSE),\"Help!\"))","v":""},null,{"$f":"IF(AK52=\"\",\"\",AI52+IF(AK52=\"XX\",VLOOKUP(\"WRONG\",Answers!Q:R,2,FALSE),AK52)+AL52)","v":""},{"$f":"Mainframe!L51","v":0},{"$f":"IF(AN52=0,\"\",IF(NOT(ISNA(VLOOKUP(AN52,Answers!S:T,2,FALSE))),VLOOKUP(AN52,Answers!S:T,2,FALSE),\"Help!\"))","v":""},null,{"$f":"IF(AO52=\"\",\"\",AM52+IF(AO52=\"XX\",VLOOKUP(\"WRONG\",Answers!S:T,2,FALSE),AO52)+AP52)","v":""},{"$f":"Mainframe!M51","v":0},{"$f":"IF(AR52=0,\"\",IF(NOT(ISNA(VLOOKUP(AR52,Answers!U:V,2,FALSE))),VLOOKUP(AR52,Answers!U:V,2,FALSE),\"Help!\"))","v":""},null,{"$f":"IF(AS52=\"\",\"\",AQ52+IF(AS52=\"XX\",VLOOKUP(\"WRONG\",Answers!U:V,2,FALSE),AS52)+AT52)","v":""},{"$f":"Mainframe!N51","v":0},{"$f":"IF(AV52=0,\"\",IF(NOT(ISNA(VLOOKUP(AV52,Answers!W:X,2,FALSE))),VLOOKUP(AV52,Answers!W:X,2,FALSE),\"Help!\"))","v":""},null,{"$f":"IF(AW52=\"\",\"\",AU52+IF(AW52=\"XX\",VLOOKUP(\"WRONG\",Answers!W:X,2,FALSE),AW52)+AX52)","v":""},{"$f":"Mainframe!O51","v":0},{"$f":"IF(AZ52=0,\"\",IF(NOT(ISNA(VLOOKUP(AZ52,Answers!Y:Z,2,FALSE))),VLOOKUP(AZ52,Answers!Y:Z,2,FALSE),\"Help!\"))","v":""},null,{"$f":"IF(BA52=\"\",\"\",AY52+IF(BA52=\"XX\",VLOOKUP(\"WRONG\",Answers!Y:Z,2,FALSE),BA52)+BB52)","v":""},{"$f":"Mainframe!P51","v":0},{"$f":"IF(BD52=0,\"\",IF(NOT(ISNA(VLOOKUP(BD52,Answers!AA:AB,2,FALSE))),VLOOKUP(BD52,Answers!AA:AB,2,FALSE),\"Help!\"))","v":""},null,{"$f":"IF(BE52=\"\",\"\",BC52+IF(BE52=\"XX\",VLOOKUP(\"WRONG\",Answers!AA:AB,2,FALSE),BE52)+BF52)","v":""},{"$f":"Mainframe!Q51","v":0},{"$f":"IF(BH52=0,\"\",IF(NOT(ISNA(VLOOKUP(BH52,Answers!AC:AD,2,FALSE))),VLOOKUP(BH52,Answers!AC:AD,2,FALSE),\"Help!\"))","v":""},null,{"$f":"IF(BI52=\"\",\"\",BG52+IF(BI52=\"XX\",VLOOKUP(\"WRONG\",Answers!AC:AD,2,FALSE),BI52)+BJ52)","v":""},{"$f":"Mainframe!R51","v":0},{"$f":"IF(BL52=0,\"\",IF(NOT(ISNA(VLOOKUP(BL52,Answers!AE:AF,2,FALSE))),VLOOKUP(BL52,Answers!AE:AF,2,FALSE),\"Help!\"))","v":""},null,{"$f":"IF(BM52=\"\",\"\",BK52+IF(BM52=\"XX\",VLOOKUP(\"WRONG\",Answers!AE:AF,2,FALSE),BM52)+BN52)","v":""},{"$f":"Mainframe!S51","v":0},{"$f":"IF(BP52=0,\"\",IF(NOT(ISNA(VLOOKUP(BP52,Answers!AG:AH,2,FALSE))),VLOOKUP(BP52,Answers!AG:AH,2,FALSE),\"Help!\"))","v":""},null,{"$f":"IF(BQ52=\"\",\"\",BO52+IF(BQ52=\"XX\",VLOOKUP(\"WRONG\",Answers!AG:AH,2,FALSE),BQ52)+BR52)","v":""},{"$f":"Mainframe!T51","v":0},{"$f":"IF(BT52=0,\"\",IF(NOT(ISNA(VLOOKUP(BT52,Answers!AI:AJ,2,FALSE))),VLOOKUP(BT52,Answers!AI:AJ,2,FALSE),\"Help!\"))","v":""},null,{"$f":"IF(BU52=\"\",\"\",BS52+IF(BU52=\"XX\",VLOOKUP(\"WRONG\",Answers!AI:AJ,2,FALSE),BU52)+BV52)","v":""},{"$f":"Mainframe!U51","v":0},{"$f":"IF(BX52=0,\"\",IF(NOT(ISNA(VLOOKUP(BX52,Answers!AK:AL,2,FALSE))),VLOOKUP(BX52,Answers!AK:AL,2,FALSE),\"Help!\"))","v":""},null,{"$f":"IF(BY52=\"\",\"\",BW52+IF(BY52=\"XX\",VLOOKUP(\"WRONG\",Answers!AK:AL,2,FALSE),BY52)+BZ52)","v":""},{"$f":"Mainframe!V51","v":0},{"$f":"IF(CB52=0,\"\",IF(NOT(ISNA(VLOOKUP(CB52,Answers!AM:AN,2,FALSE))),VLOOKUP(CB52,Answers!AM:AN,2,FALSE),\"Help!\"))","v":""},null,{"$f":"IF(CC52=\"\",\"\",CA52+IF(CC52=\"XX\",VLOOKUP(\"WRONG\",Answers!AM:AN,2,FALSE),CC52)+CD52)","v":""},null,null,"","","","",""]
["[*]",{"$f":"Mainframe!B52","v":0},51,{"$f":"Mainframe!C52","v":0},{"$f":"IF(D53=0,\"\",IF(NOT(ISNA(VLOOKUP(D53,Answers!A:B,2,FALSE))),VLOOKUP(D53,Answers!A:B,2,FALSE),\"Help!\"))","v":""},null,{"$f":"IF(E53=\"\",\"\",IF(E53=\"XX\",VLOOKUP(\"WRONG\",Answers!A:B,2,FALSE),E53)+F53)","v":""},{"$f":"Mainframe!D52","v":0},{"$f":"IF(H53=0,\"\",IF(NOT(ISNA(VLOOKUP(H53,Answers!C:D,2,FALSE))),VLOOKUP(H53,Answers!C:D,2,FALSE),\"Help!\"))","v":""},null,{"$f":"IF(I53=\"\",\"\",G53+IF(I53=\"XX\",VLOOKUP(\"WRONG\",Answers!C:D,2,FALSE),I53)+J53)","v":""},{"$f":"Mainframe!E52","v":0},{"$f":"IF(L53=0,\"\",IF(NOT(ISNA(VLOOKUP(L53,Answers!E:F,2,FALSE))),VLOOKUP(L53,Answers!E:F,2,FALSE),\"Help!\"))","v":""},null,{"$f":"IF(M53=\"\",\"\",K53+IF(M53=\"XX\",VLOOKUP(\"WRONG\",Answers!E:F,2,FALSE),M53)+N53)","v":""},{"$f":"Mainframe!F52","v":0},{"$f":"IF(P53=0,\"\",IF(NOT(ISNA(VLOOKUP(P53,Answers!G:H,2,FALSE))),VLOOKUP(P53,Answers!G:H,2,FALSE),\"Help!\"))","v":""},null,{"$f":"IF(Q53=\"\",\"\",O53+IF(Q53=\"XX\",VLOOKUP(\"WRONG\",Answers!G:H,2,FALSE),Q53)+R53)","v":""},{"$f":"Mainframe!G52","v":0},{"$f":"IF(T53=0,\"\",IF(NOT(ISNA(VLOOKUP(T53,Answers!I:J,2,FALSE))),VLOOKUP(T53,Answers!I:J,2,FALSE),\"Help!\"))","v":""},null,{"$f":"IF(U53=\"\",\"\",S53+IF(U53=\"XX\",VLOOKUP(\"WRONG\",Answers!I:J,2,FALSE),U53)+V53)","v":""},{"$f":"Mainframe!H52","v":0},{"$f":"IF(X53=0,\"\",IF(NOT(ISNA(VLOOKUP(X53,Answers!K:L,2,FALSE))),VLOOKUP(X53,Answers!K:L,2,FALSE),\"Help!\"))","v":""},null,{"$f":"IF(Y53=\"\",\"\",W53+IF(Y53=\"XX\",VLOOKUP(\"WRONG\",Answers!K:L,2,FALSE),Y53)+Z53)","v":""},{"$f":"Mainframe!I52","v":0},{"$f":"IF(AB53=0,\"\",IF(NOT(ISNA(VLOOKUP(AB53,Answers!M:N,2,FALSE))),VLOOKUP(AB53,Answers!M:N,2,FALSE),\"Help!\"))","v":""},null,{"$f":"IF(AC53=\"\",\"\",AA53+IF(AC53=\"XX\",VLOOKUP(\"WRONG\",Answers!M:N,2,FALSE),AC53)+AD53)","v":""},{"$f":"Mainframe!J52","v":0},{"$f":"IF(AF53=0,\"\",IF(NOT(ISNA(VLOOKUP(AF53,Answers!O:P,2,FALSE))),VLOOKUP(AF53,Answers!O:P,2,FALSE),\"Help!\"))","v":""},null,{"$f":"IF(AG53=\"\",\"\",AE53+IF(AG53=\"XX\",VLOOKUP(\"WRONG\",Answers!O:P,2,FALSE),AG53)+AH53)","v":""},{"$f":"Mainframe!K52","v":0},{"$f":"IF(AJ53=0,\"\",IF(NOT(ISNA(VLOOKUP(AJ53,Answers!Q:R,2,FALSE))),VLOOKUP(AJ53,Answers!Q:R,2,FALSE),\"Help!\"))","v":""},null,{"$f":"IF(AK53=\"\",\"\",AI53+IF(AK53=\"XX\",VLOOKUP(\"WRONG\",Answers!Q:R,2,FALSE),AK53)+AL53)","v":""},{"$f":"Mainframe!L52","v":0},{"$f":"IF(AN53=0,\"\",IF(NOT(ISNA(VLOOKUP(AN53,Answers!S:T,2,FALSE))),VLOOKUP(AN53,Answers!S:T,2,FALSE),\"Help!\"))","v":""},null,{"$f":"IF(AO53=\"\",\"\",AM53+IF(AO53=\"XX\",VLOOKUP(\"WRONG\",Answers!S:T,2,FALSE),AO53)+AP53)","v":""},{"$f":"Mainframe!M52","v":0},{"$f":"IF(AR53=0,\"\",IF(NOT(ISNA(VLOOKUP(AR53,Answers!U:V,2,FALSE))),VLOOKUP(AR53,Answers!U:V,2,FALSE),\"Help!\"))","v":""},null,{"$f":"IF(AS53=\"\",\"\",AQ53+IF(AS53=\"XX\",VLOOKUP(\"WRONG\",Answers!U:V,2,FALSE),AS53)+AT53)","v":""},{"$f":"Mainframe!N52","v":0},{"$f":"IF(AV53=0,\"\",IF(NOT(ISNA(VLOOKUP(AV53,Answers!W:X,2,FALSE))),VLOOKUP(AV53,Answers!W:X,2,FALSE),\"Help!\"))","v":""},null,{"$f":"IF(AW53=\"\",\"\",AU53+IF(AW53=\"XX\",VLOOKUP(\"WRONG\",Answers!W:X,2,FALSE),AW53)+AX53)","v":""},{"$f":"Mainframe!O52","v":0},{"$f":"IF(AZ53=0,\"\",IF(NOT(ISNA(VLOOKUP(AZ53,Answers!Y:Z,2,FALSE))),VLOOKUP(AZ53,Answers!Y:Z,2,FALSE),\"Help!\"))","v":""},null,{"$f":"IF(BA53=\"\",\"\",AY53+IF(BA53=\"XX\",VLOOKUP(\"WRONG\",Answers!Y:Z,2,FALSE),BA53)+BB53)","v":""},{"$f":"Mainframe!P52","v":0},{"$f":"IF(BD53=0,\"\",IF(NOT(ISNA(VLOOKUP(BD53,Answers!AA:AB,2,FALSE))),VLOOKUP(BD53,Answers!AA:AB,2,FALSE),\"Help!\"))","v":""},null,{"$f":"IF(BE53=\"\",\"\",BC53+IF(BE53=\"XX\",VLOOKUP(\"WRONG\",Answers!AA:AB,2,FALSE),BE53)+BF53)","v":""},{"$f":"Mainframe!Q52","v":0},{"$f":"IF(BH53=0,\"\",IF(NOT(ISNA(VLOOKUP(BH53,Answers!AC:AD,2,FALSE))),VLOOKUP(BH53,Answers!AC:AD,2,FALSE),\"Help!\"))","v":""},null,{"$f":"IF(BI53=\"\",\"\",BG53+IF(BI53=\"XX\",VLOOKUP(\"WRONG\",Answers!AC:AD,2,FALSE),BI53)+BJ53)","v":""},{"$f":"Mainframe!R52","v":0},{"$f":"IF(BL53=0,\"\",IF(NOT(ISNA(VLOOKUP(BL53,Answers!AE:AF,2,FALSE))),VLOOKUP(BL53,Answers!AE:AF,2,FALSE),\"Help!\"))","v":""},null,{"$f":"IF(BM53=\"\",\"\",BK53+IF(BM53=\"XX\",VLOOKUP(\"WRONG\",Answers!AE:AF,2,FALSE),BM53)+BN53)","v":""},{"$f":"Mainframe!S52","v":0},{"$f":"IF(BP53=0,\"\",IF(NOT(ISNA(VLOOKUP(BP53,Answers!AG:AH,2,FALSE))),VLOOKUP(BP53,Answers!AG:AH,2,FALSE),\"Help!\"))","v":""},null,{"$f":"IF(BQ53=\"\",\"\",BO53+IF(BQ53=\"XX\",VLOOKUP(\"WRONG\",Answers!AG:AH,2,FALSE),BQ53)+BR53)","v":""},{"$f":"Mainframe!T52","v":0},{"$f":"IF(BT53=0,\"\",IF(NOT(ISNA(VLOOKUP(BT53,Answers!AI:AJ,2,FALSE))),VLOOKUP(BT53,Answers!AI:AJ,2,FALSE),\"Help!\"))","v":""},null,{"$f":"IF(BU53=\"\",\"\",BS53+IF(BU53=\"XX\",VLOOKUP(\"WRONG\",Answers!AI:AJ,2,FALSE),BU53)+BV53)","v":""},{"$f":"Mainframe!U52","v":0},{"$f":"IF(BX53=0,\"\",IF(NOT(ISNA(VLOOKUP(BX53,Answers!AK:AL,2,FALSE))),VLOOKUP(BX53,Answers!AK:AL,2,FALSE),\"Help!\"))","v":""},null,{"$f":"IF(BY53=\"\",\"\",BW53+IF(BY53=\"XX\",VLOOKUP(\"WRONG\",Answers!AK:AL,2,FALSE),BY53)+BZ53)","v":""},{"$f":"Mainframe!V52","v":0},{"$f":"IF(CB53=0,\"\",IF(NOT(ISNA(VLOOKUP(CB53,Answers!AM:AN,2,FALSE))),VLOOKUP(CB53,Answers!AM:AN,2,FALSE),\"Help!\"))","v":""},null,{"$f":"IF(CC53=\"\",\"\",CA53+IF(CC53=\"XX\",VLOOKUP(\"WRONG\",Answers!AM:AN,2,FALSE),CC53)+CD53)","v":""},null,null,"","","","",""]
["[*]",{"$f":"Mainframe!B53","v":0},52,{"$f":"Mainframe!C53","v":0},{"$f":"IF(D54=0,\"\",IF(NOT(ISNA(VLOOKUP(D54,Answers!A:B,2,FALSE))),VLOOKUP(D54,Answers!A:B,2,FALSE),\"Help!\"))","v":""},null,{"$f":"IF(E54=\"\",\"\",IF(E54=\"XX\",VLOOKUP(\"WRONG\",Answers!A:B,2,FALSE),E54)+F54)","v":""},{"$f":"Mainframe!D53","v":0},{"$f":"IF(H54=0,\"\",IF(NOT(ISNA(VLOOKUP(H54,Answers!C:D,2,FALSE))),VLOOKUP(H54,Answers!C:D,2,FALSE),\"Help!\"))","v":""},null,{"$f":"IF(I54=\"\",\"\",G54+IF(I54=\"XX\",VLOOKUP(\"WRONG\",Answers!C:D,2,FALSE),I54)+J54)","v":""},{"$f":"Mainframe!E53","v":0},{"$f":"IF(L54=0,\"\",IF(NOT(ISNA(VLOOKUP(L54,Answers!E:F,2,FALSE))),VLOOKUP(L54,Answers!E:F,2,FALSE),\"Help!\"))","v":""},null,{"$f":"IF(M54=\"\",\"\",K54+IF(M54=\"XX\",VLOOKUP(\"WRONG\",Answers!E:F,2,FALSE),M54)+N54)","v":""},{"$f":"Mainframe!F53","v":0},{"$f":"IF(P54=0,\"\",IF(NOT(ISNA(VLOOKUP(P54,Answers!G:H,2,FALSE))),VLOOKUP(P54,Answers!G:H,2,FALSE),\"Help!\"))","v":""},null,{"$f":"IF(Q54=\"\",\"\",O54+IF(Q54=\"XX\",VLOOKUP(\"WRONG\",Answers!G:H,2,FALSE),Q54)+R54)","v":""},{"$f":"Mainframe!G53","v":0},{"$f":"IF(T54=0,\"\",IF(NOT(ISNA(VLOOKUP(T54,Answers!I:J,2,FALSE))),VLOOKUP(T54,Answers!I:J,2,FALSE),\"Help!\"))","v":""},null,{"$f":"IF(U54=\"\",\"\",S54+IF(U54=\"XX\",VLOOKUP(\"WRONG\",Answers!I:J,2,FALSE),U54)+V54)","v":""},{"$f":"Mainframe!H53","v":0},{"$f":"IF(X54=0,\"\",IF(NOT(ISNA(VLOOKUP(X54,Answers!K:L,2,FALSE))),VLOOKUP(X54,Answers!K:L,2,FALSE),\"Help!\"))","v":""},null,{"$f":"IF(Y54=\"\",\"\",W54+IF(Y54=\"XX\",VLOOKUP(\"WRONG\",Answers!K:L,2,FALSE),Y54)+Z54)","v":""},{"$f":"Mainframe!I53","v":0},{"$f":"IF(AB54=0,\"\",IF(NOT(ISNA(VLOOKUP(AB54,Answers!M:N,2,FALSE))),VLOOKUP(AB54,Answers!M:N,2,FALSE),\"Help!\"))","v":""},null,{"$f":"IF(AC54=\"\",\"\",AA54+IF(AC54=\"XX\",VLOOKUP(\"WRONG\",Answers!M:N,2,FALSE),AC54)+AD54)","v":""},{"$f":"Mainframe!J53","v":0},{"$f":"IF(AF54=0,\"\",IF(NOT(ISNA(VLOOKUP(AF54,Answers!O:P,2,FALSE))),VLOOKUP(AF54,Answers!O:P,2,FALSE),\"Help!\"))","v":""},null,{"$f":"IF(AG54=\"\",\"\",AE54+IF(AG54=\"XX\",VLOOKUP(\"WRONG\",Answers!O:P,2,FALSE),AG54)+AH54)","v":""},{"$f":"Mainframe!K53","v":0},{"$f":"IF(AJ54=0,\"\",IF(NOT(ISNA(VLOOKUP(AJ54,Answers!Q:R,2,FALSE))),VLOOKUP(AJ54,Answers!Q:R,2,FALSE),\"Help!\"))","v":""},null,{"$f":"IF(AK54=\"\",\"\",AI54+IF(AK54=\"XX\",VLOOKUP(\"WRONG\",Answers!Q:R,2,FALSE),AK54)+AL54)","v":""},{"$f":"Mainframe!L53","v":0},{"$f":"IF(AN54=0,\"\",IF(NOT(ISNA(VLOOKUP(AN54,Answers!S:T,2,FALSE))),VLOOKUP(AN54,Answers!S:T,2,FALSE),\"Help!\"))","v":""},null,{"$f":"IF(AO54=\"\",\"\",AM54+IF(AO54=\"XX\",VLOOKUP(\"WRONG\",Answers!S:T,2,FALSE),AO54)+AP54)","v":""},{"$f":"Mainframe!M53","v":0},{"$f":"IF(AR54=0,\"\",IF(NOT(ISNA(VLOOKUP(AR54,Answers!U:V,2,FALSE))),VLOOKUP(AR54,Answers!U:V,2,FALSE),\"Help!\"))","v":""},null,{"$f":"IF(AS54=\"\",\"\",AQ54+IF(AS54=\"XX\",VLOOKUP(\"WRONG\",Answers!U:V,2,FALSE),AS54)+AT54)","v":""},{"$f":"Mainframe!N53","v":0},{"$f":"IF(AV54=0,\"\",IF(NOT(ISNA(VLOOKUP(AV54,Answers!W:X,2,FALSE))),VLOOKUP(AV54,Answers!W:X,2,FALSE),\"Help!\"))","v":""},null,{"$f":"IF(AW54=\"\",\"\",AU54+IF(AW54=\"XX\",VLOOKUP(\"WRONG\",Answers!W:X,2,FALSE),AW54)+AX54)","v":""},{"$f":"Mainframe!O53","v":0},{"$f":"IF(AZ54=0,\"\",IF(NOT(ISNA(VLOOKUP(AZ54,Answers!Y:Z,2,FALSE))),VLOOKUP(AZ54,Answers!Y:Z,2,FALSE),\"Help!\"))","v":""},null,{"$f":"IF(BA54=\"\",\"\",AY54+IF(BA54=\"XX\",VLOOKUP(\"WRONG\",Answers!Y:Z,2,FALSE),BA54)+BB54)","v":""},{"$f":"Mainframe!P53","v":0},{"$f":"IF(BD54=0,\"\",IF(NOT(ISNA(VLOOKUP(BD54,Answers!AA:AB,2,FALSE))),VLOOKUP(BD54,Answers!AA:AB,2,FALSE),\"Help!\"))","v":""},null,{"$f":"IF(BE54=\"\",\"\",BC54+IF(BE54=\"XX\",VLOOKUP(\"WRONG\",Answers!AA:AB,2,FALSE),BE54)+BF54)","v":""},{"$f":"Mainframe!Q53","v":0},{"$f":"IF(BH54=0,\"\",IF(NOT(ISNA(VLOOKUP(BH54,Answers!AC:AD,2,FALSE))),VLOOKUP(BH54,Answers!AC:AD,2,FALSE),\"Help!\"))","v":""},null,{"$f":"IF(BI54=\"\",\"\",BG54+IF(BI54=\"XX\",VLOOKUP(\"WRONG\",Answers!AC:AD,2,FALSE),BI54)+BJ54)","v":""},{"$f":"Mainframe!R53","v":0},{"$f":"IF(BL54=0,\"\",IF(NOT(ISNA(VLOOKUP(BL54,Answers!AE:AF,2,FALSE))),VLOOKUP(BL54,Answers!AE:AF,2,FALSE),\"Help!\"))","v":""},null,{"$f":"IF(BM54=\"\",\"\",BK54+IF(BM54=\"XX\",VLOOKUP(\"WRONG\",Answers!AE:AF,2,FALSE),BM54)+BN54)","v":""},{"$f":"Mainframe!S53","v":0},{"$f":"IF(BP54=0,\"\",IF(NOT(ISNA(VLOOKUP(BP54,Answers!AG:AH,2,FALSE))),VLOOKUP(BP54,Answers!AG:AH,2,FALSE),\"Help!\"))","v":""},null,{"$f":"IF(BQ54=\"\",\"\",BO54+IF(BQ54=\"XX\",VLOOKUP(\"WRONG\",Answers!AG:AH,2,FALSE),BQ54)+BR54)","v":""},{"$f":"Mainframe!T53","v":0},{"$f":"IF(BT54=0,\"\",IF(NOT(ISNA(VLOOKUP(BT54,Answers!AI:AJ,2,FALSE))),VLOOKUP(BT54,Answers!AI:AJ,2,FALSE),\"Help!\"))","v":""},null,{"$f":"IF(BU54=\"\",\"\",BS54+IF(BU54=\"XX\",VLOOKUP(\"WRONG\",Answers!AI:AJ,2,FALSE),BU54)+BV54)","v":""},{"$f":"Mainframe!U53","v":0},{"$f":"IF(BX54=0,\"\",IF(NOT(ISNA(VLOOKUP(BX54,Answers!AK:AL,2,FALSE))),VLOOKUP(BX54,Answers!AK:AL,2,FALSE),\"Help!\"))","v":""},null,{"$f":"IF(BY54=\"\",\"\",BW54+IF(BY54=\"XX\",VLOOKUP(\"WRONG\",Answers!AK:AL,2,FALSE),BY54)+BZ54)","v":""},{"$f":"Mainframe!V53","v":0},{"$f":"IF(CB54=0,\"\",IF(NOT(ISNA(VLOOKUP(CB54,Answers!AM:AN,2,FALSE))),VLOOKUP(CB54,Answers!AM:AN,2,FALSE),\"Help!\"))","v":""},null,{"$f":"IF(CC54=\"\",\"\",CA54+IF(CC54=\"XX\",VLOOKUP(\"WRONG\",Answers!AM:AN,2,FALSE),CC54)+CD54)","v":""},null,null,"","","","",""]
["[*]",{"$f":"Mainframe!B54","v":0},53,{"$f":"Mainframe!C54","v":0},{"$f":"IF(D55=0,\"\",IF(NOT(ISNA(VLOOKUP(D55,Answers!A:B,2,FALSE))),VLOOKUP(D55,Answers!A:B,2,FALSE),\"Help!\"))","v":""},null,{"$f":"IF(E55=\"\",\"\",IF(E55=\"XX\",VLOOKUP(\"WRONG\",Answers!A:B,2,FALSE),E55)+F55)","v":""},{"$f":"Mainframe!D54","v":0},{"$f":"IF(H55=0,\"\",IF(NOT(ISNA(VLOOKUP(H55,Answers!C:D,2,FALSE))),VLOOKUP(H55,Answers!C:D,2,FALSE),\"Help!\"))","v":""},null,{"$f":"IF(I55=\"\",\"\",G55+IF(I55=\"XX\",VLOOKUP(\"WRONG\",Answers!C:D,2,FALSE),I55)+J55)","v":""},{"$f":"Mainframe!E54","v":0},{"$f":"IF(L55=0,\"\",IF(NOT(ISNA(VLOOKUP(L55,Answers!E:F,2,FALSE))),VLOOKUP(L55,Answers!E:F,2,FALSE),\"Help!\"))","v":""},null,{"$f":"IF(M55=\"\",\"\",K55+IF(M55=\"XX\",VLOOKUP(\"WRONG\",Answers!E:F,2,FALSE),M55)+N55)","v":""},{"$f":"Mainframe!F54","v":0},{"$f":"IF(P55=0,\"\",IF(NOT(ISNA(VLOOKUP(P55,Answers!G:H,2,FALSE))),VLOOKUP(P55,Answers!G:H,2,FALSE),\"Help!\"))","v":""},null,{"$f":"IF(Q55=\"\",\"\",O55+IF(Q55=\"XX\",VLOOKUP(\"WRONG\",Answers!G:H,2,FALSE),Q55)+R55)","v":""},{"$f":"Mainframe!G54","v":0},{"$f":"IF(T55=0,\"\",IF(NOT(ISNA(VLOOKUP(T55,Answers!I:J,2,FALSE))),VLOOKUP(T55,Answers!I:J,2,FALSE),\"Help!\"))","v":""},null,{"$f":"IF(U55=\"\",\"\",S55+IF(U55=\"XX\",VLOOKUP(\"WRONG\",Answers!I:J,2,FALSE),U55)+V55)","v":""},{"$f":"Mainframe!H54","v":0},{"$f":"IF(X55=0,\"\",IF(NOT(ISNA(VLOOKUP(X55,Answers!K:L,2,FALSE))),VLOOKUP(X55,Answers!K:L,2,FALSE),\"Help!\"))","v":""},null,{"$f":"IF(Y55=\"\",\"\",W55+IF(Y55=\"XX\",VLOOKUP(\"WRONG\",Answers!K:L,2,FALSE),Y55)+Z55)","v":""},{"$f":"Mainframe!I54","v":0},{"$f":"IF(AB55=0,\"\",IF(NOT(ISNA(VLOOKUP(AB55,Answers!M:N,2,FALSE))),VLOOKUP(AB55,Answers!M:N,2,FALSE),\"Help!\"))","v":""},null,{"$f":"IF(AC55=\"\",\"\",AA55+IF(AC55=\"XX\",VLOOKUP(\"WRONG\",Answers!M:N,2,FALSE),AC55)+AD55)","v":""},{"$f":"Mainframe!J54","v":0},{"$f":"IF(AF55=0,\"\",IF(NOT(ISNA(VLOOKUP(AF55,Answers!O:P,2,FALSE))),VLOOKUP(AF55,Answers!O:P,2,FALSE),\"Help!\"))","v":""},null,{"$f":"IF(AG55=\"\",\"\",AE55+IF(AG55=\"XX\",VLOOKUP(\"WRONG\",Answers!O:P,2,FALSE),AG55)+AH55)","v":""},{"$f":"Mainframe!K54","v":0},{"$f":"IF(AJ55=0,\"\",IF(NOT(ISNA(VLOOKUP(AJ55,Answers!Q:R,2,FALSE))),VLOOKUP(AJ55,Answers!Q:R,2,FALSE),\"Help!\"))","v":""},null,{"$f":"IF(AK55=\"\",\"\",AI55+IF(AK55=\"XX\",VLOOKUP(\"WRONG\",Answers!Q:R,2,FALSE),AK55)+AL55)","v":""},{"$f":"Mainframe!L54","v":0},{"$f":"IF(AN55=0,\"\",IF(NOT(ISNA(VLOOKUP(AN55,Answers!S:T,2,FALSE))),VLOOKUP(AN55,Answers!S:T,2,FALSE),\"Help!\"))","v":""},null,{"$f":"IF(AO55=\"\",\"\",AM55+IF(AO55=\"XX\",VLOOKUP(\"WRONG\",Answers!S:T,2,FALSE),AO55)+AP55)","v":""},{"$f":"Mainframe!M54","v":0},{"$f":"IF(AR55=0,\"\",IF(NOT(ISNA(VLOOKUP(AR55,Answers!U:V,2,FALSE))),VLOOKUP(AR55,Answers!U:V,2,FALSE),\"Help!\"))","v":""},null,{"$f":"IF(AS55=\"\",\"\",AQ55+IF(AS55=\"XX\",VLOOKUP(\"WRONG\",Answers!U:V,2,FALSE),AS55)+AT55)","v":""},{"$f":"Mainframe!N54","v":0},{"$f":"IF(AV55=0,\"\",IF(NOT(ISNA(VLOOKUP(AV55,Answers!W:X,2,FALSE))),VLOOKUP(AV55,Answers!W:X,2,FALSE),\"Help!\"))","v":""},null,{"$f":"IF(AW55=\"\",\"\",AU55+IF(AW55=\"XX\",VLOOKUP(\"WRONG\",Answers!W:X,2,FALSE),AW55)+AX55)","v":""},{"$f":"Mainframe!O54","v":0},{"$f":"IF(AZ55=0,\"\",IF(NOT(ISNA(VLOOKUP(AZ55,Answers!Y:Z,2,FALSE))),VLOOKUP(AZ55,Answers!Y:Z,2,FALSE),\"Help!\"))","v":""},null,{"$f":"IF(BA55=\"\",\"\",AY55+IF(BA55=\"XX\",VLOOKUP(\"WRONG\",Answers!Y:Z,2,FALSE),BA55)+BB55)","v":""},{"$f":"Mainframe!P54","v":0},{"$f":"IF(BD55=0,\"\",IF(NOT(ISNA(VLOOKUP(BD55,Answers!AA:AB,2,FALSE))),VLOOKUP(BD55,Answers!AA:AB,2,FALSE),\"Help!\"))","v":""},null,{"$f":"IF(BE55=\"\",\"\",BC55+IF(BE55=\"XX\",VLOOKUP(\"WRONG\",Answers!AA:AB,2,FALSE),BE55)+BF55)","v":""},{"$f":"Mainframe!Q54","v":0},{"$f":"IF(BH55=0,\"\",IF(NOT(ISNA(VLOOKUP(BH55,Answers!AC:AD,2,FALSE))),VLOOKUP(BH55,Answers!AC:AD,2,FALSE),\"Help!\"))","v":""},null,{"$f":"IF(BI55=\"\",\"\",BG55+IF(BI55=\"XX\",VLOOKUP(\"WRONG\",Answers!AC:AD,2,FALSE),BI55)+BJ55)","v":""},{"$f":"Mainframe!R54","v":0},{"$f":"IF(BL55=0,\"\",IF(NOT(ISNA(VLOOKUP(BL55,Answers!AE:AF,2,FALSE))),VLOOKUP(BL55,Answers!AE:AF,2,FALSE),\"Help!\"))","v":""},null,{"$f":"IF(BM55=\"\",\"\",BK55+IF(BM55=\"XX\",VLOOKUP(\"WRONG\",Answers!AE:AF,2,FALSE),BM55)+BN55)","v":""},{"$f":"Mainframe!S54","v":0},{"$f":"IF(BP55=0,\"\",IF(NOT(ISNA(VLOOKUP(BP55,Answers!AG:AH,2,FALSE))),VLOOKUP(BP55,Answers!AG:AH,2,FALSE),\"Help!\"))","v":""},null,{"$f":"IF(BQ55=\"\",\"\",BO55+IF(BQ55=\"XX\",VLOOKUP(\"WRONG\",Answers!AG:AH,2,FALSE),BQ55)+BR55)","v":""},{"$f":"Mainframe!T54","v":0},{"$f":"IF(BT55=0,\"\",IF(NOT(ISNA(VLOOKUP(BT55,Answers!AI:AJ,2,FALSE))),VLOOKUP(BT55,Answers!AI:AJ,2,FALSE),\"Help!\"))","v":""},null,{"$f":"IF(BU55=\"\",\"\",BS55+IF(BU55=\"XX\",VLOOKUP(\"WRONG\",Answers!AI:AJ,2,FALSE),BU55)+BV55)","v":""},{"$f":"Mainframe!U54","v":0},{"$f":"IF(BX55=0,\"\",IF(NOT(ISNA(VLOOKUP(BX55,Answers!AK:AL,2,FALSE))),VLOOKUP(BX55,Answers!AK:AL,2,FALSE),\"Help!\"))","v":""},null,{"$f":"IF(BY55=\"\",\"\",BW55+IF(BY55=\"XX\",VLOOKUP(\"WRONG\",Answers!AK:AL,2,FALSE),BY55)+BZ55)","v":""},{"$f":"Mainframe!V54","v":0},{"$f":"IF(CB55=0,\"\",IF(NOT(ISNA(VLOOKUP(CB55,Answers!AM:AN,2,FALSE))),VLOOKUP(CB55,Answers!AM:AN,2,FALSE),\"Help!\"))","v":""},null,{"$f":"IF(CC55=\"\",\"\",CA55+IF(CC55=\"XX\",VLOOKUP(\"WRONG\",Answers!AM:AN,2,FALSE),CC55)+CD55)","v":""},null,null,"","","","",""]

{"sheet":"Answers","index":2,"n_rows":25,"n_cols":40,"rows_kept":25,"cut":false,"hidden":false,"merged":[]}
["Question 1",null,"Question 2",null,"Question 3",null,"Question 4",null,"Question 5",null,"Question 6",null,"Question 7",null,"Question 8",null,"Question 9",null,"Question 10",null,"Question 11",null,"Question 12",null,"Question 13",null,"Question 14",null,"Question 15",null,"Question 16",null,"Question 17",null,"Question 18",null,"Question 19",null,"Question 20"]
[null,{"$f":"IF(ISBLANK(A2),\"\",COUNTIF(Scoresheet!D:D,A2))","v":""},null,{"$f":"IF(ISBLANK(C2),\"\",COUNTIF(Scoresheet!H:H,C2))","v":""},null,{"$f":"IF(ISBLANK(E2),\"\",COUNTIF(Scoresheet!L:L,E2))","v":""},null,{"$f":"IF(ISBLANK(G2),\"\",COUNTIF(Scoresheet!P:P,G2))","v":""},null,{"$f":"IF(ISBLANK(I2),\"\",COUNTIF(Scoresheet!T:T,I2))","v":""},null,{"$f":"IF(ISBLANK(K2),\"\",COUNTIF(Scoresheet!X:X,K2))","v":""},null,{"$f":"IF(ISBLANK(M2),\"\",COUNTIF(Scoresheet!AB:AB,M2))","v":""},null,{"$f":"IF(ISBLANK(O2),\"\",COUNTIF(Scoresheet!AF:AF,O2))","v":""},null,{"$f":"IF(ISBLANK(Q2),\"\",COUNTIF(Scoresheet!AJ:AJ,Q2))","v":""},null,{"$f":"IF(ISBLANK(S2),\"\",COUNTIF(Scoresheet!AN:AN,S2))","v":""},null,{"$f":"IF(ISBLANK(U2),\"\",COUNTIF(Scoresheet!AR:AR,U2))","v":""},null,{"$f":"IF(ISBLANK(W2),\"\",COUNTIF(Scoresheet!AV:AV,W2))","v":""},null,{"$f":"IF(ISBLANK(Y2),\"\",COUNTIF(Scoresheet!AZ:AZ,Y2))","v":""},null,{"$f":"IF(ISBLANK(AA2),\"\",COUNTIF(Scoresheet!BD:BD,AA2))","v":""},null,{"$f":"IF(ISBLANK(AC2),\"\",COUNTIF(Scoresheet!BH:BH,AC2))","v":""},null,{"$f":"IF(ISBLANK(AE2),\"\",COUNTIF(Scoresheet!BL:BL,AE2))","v":""},null,{"$f":"IF(ISBLANK(AG2),\"\",COUNTIF(Scoresheet!BP:BP,AG2))","v":""},null,{"$f":"IF(ISBLANK(AI2),\"\",COUNTIF(Scoresheet!BT:BT,AI2))","v":""},null,{"$f":"IF(ISBLANK(AK2),\"\",COUNTIF(Scoresheet!BX:BX,AK2))","v":""},null,{"$f":"IF(ISBLANK(AM2),\"\",COUNTIF(Scoresheet!CB:CB,AM2))","v":""}]
[null,{"$f":"IF(ISBLANK(A3),\"\",COUNTIF(Scoresheet!D:D,A3))","v":""},null,{"$f":"IF(ISBLANK(C3),\"\",COUNTIF(Scoresheet!H:H,C3))","v":""},null,{"$f":"IF(ISBLANK(E3),\"\",COUNTIF(Scoresheet!L:L,E3))","v":""},null,{"$f":"IF(ISBLANK(G3),\"\",COUNTIF(Scoresheet!P:P,G3))","v":""},null,{"$f":"IF(ISBLANK(I3),\"\",COUNTIF(Scoresheet!T:T,I3))","v":""},null,{"$f":"IF(ISBLANK(K3),\"\",COUNTIF(Scoresheet!X:X,K3))","v":""},null,{"$f":"IF(ISBLANK(M3),\"\",COUNTIF(Scoresheet!AB:AB,M3))","v":""},null,{"$f":"IF(ISBLANK(O3),\"\",COUNTIF(Scoresheet!AF:AF,O3))","v":""},null,{"$f":"IF(ISBLANK(Q3),\"\",COUNTIF(Scoresheet!AJ:AJ,Q3))","v":""},null,{"$f":"IF(ISBLANK(S3),\"\",COUNTIF(Scoresheet!AN:AN,S3))","v":""},null,{"$f":"IF(ISBLANK(U3),\"\",COUNTIF(Scoresheet!AR:AR,U3))","v":""},null,{"$f":"IF(ISBLANK(W3),\"\",COUNTIF(Scoresheet!AV:AV,W3))","v":""},null,{"$f":"IF(ISBLANK(Y3),\"\",COUNTIF(Scoresheet!AZ:AZ,Y3))","v":""},null,{"$f":"IF(ISBLANK(AA3),\"\",COUNTIF(Scoresheet!BD:BD,AA3))","v":""},null,{"$f":"IF(ISBLANK(AC3),\"\",COUNTIF(Scoresheet!BH:BH,AC3))","v":""},null,{"$f":"IF(ISBLANK(AE3),\"\",COUNTIF(Scoresheet!BL:BL,AE3))","v":""},null,{"$f":"IF(ISBLANK(AG3),\"\",COUNTIF(Scoresheet!BP:BP,AG3))","v":""},null,{"$f":"IF(ISBLANK(AI3),\"\",COUNTIF(Scoresheet!BT:BT,AI3))","v":""},null,{"$f":"IF(ISBLANK(AK3),\"\",COUNTIF(Scoresheet!BX:BX,AK3))","v":""},null,{"$f":"IF(ISBLANK(AM3),\"\",COUNTIF(Scoresheet!CB:CB,AM3))","v":""}]
[null,{"$f":"IF(ISBLANK(A4),\"\",COUNTIF(Scoresheet!D:D,A4))","v":""},null,{"$f":"IF(ISBLANK(C4),\"\",COUNTIF(Scoresheet!H:H,C4))","v":""},null,{"$f":"IF(ISBLANK(E4),\"\",COUNTIF(Scoresheet!L:L,E4))","v":""},null,{"$f":"IF(ISBLANK(G4),\"\",COUNTIF(Scoresheet!P:P,G4))","v":""},null,{"$f":"IF(ISBLANK(I4),\"\",COUNTIF(Scoresheet!T:T,I4))","v":""},null,{"$f":"IF(ISBLANK(K4),\"\",COUNTIF(Scoresheet!X:X,K4))","v":""},null,{"$f":"IF(ISBLANK(M4),\"\",COUNTIF(Scoresheet!AB:AB,M4))","v":""},null,{"$f":"IF(ISBLANK(O4),\"\",COUNTIF(Scoresheet!AF:AF,O4))","v":""},null,{"$f":"IF(ISBLANK(Q4),\"\",COUNTIF(Scoresheet!AJ:AJ,Q4))","v":""},null,{"$f":"IF(ISBLANK(S4),\"\",COUNTIF(Scoresheet!AN:AN,S4))","v":""},null,{"$f":"IF(ISBLANK(U4),\"\",COUNTIF(Scoresheet!AR:AR,U4))","v":""},null,{"$f":"IF(ISBLANK(W4),\"\",COUNTIF(Scoresheet!AV:AV,W4))","v":""},null,{"$f":"IF(ISBLANK(Y4),\"\",COUNTIF(Scoresheet!AZ:AZ,Y4))","v":""},null,{"$f":"IF(ISBLANK(AA4),\"\",COUNTIF(Scoresheet!BD:BD,AA4))","v":""},null,{"$f":"IF(ISBLANK(AC4),\"\",COUNTIF(Scoresheet!BH:BH,AC4))","v":""},null,{"$f":"IF(ISBLANK(AE4),\"\",COUNTIF(Scoresheet!BL:BL,AE4))","v":""},null,{"$f":"IF(ISBLANK(AG4),\"\",COUNTIF(Scoresheet!BP:BP,AG4))","v":""},null,{"$f":"IF(ISBLANK(AI4),\"\",COUNTIF(Scoresheet!BT:BT,AI4))","v":""},null,{"$f":"IF(ISBLANK(AK4),\"\",COUNTIF(Scoresheet!BX:BX,AK4))","v":""},null,{"$f":"IF(ISBLANK(AM4),\"\",COUNTIF(Scoresheet!CB:CB,AM4))","v":""}]
[null,{"$f":"IF(ISBLANK(A5),\"\",COUNTIF(Scoresheet!D:D,A5))","v":""},null,{"$f":"IF(ISBLANK(C5),\"\",COUNTIF(Scoresheet!H:H,C5))","v":""},null,{"$f":"IF(ISBLANK(E5),\"\",COUNTIF(Scoresheet!L:L,E5))","v":""},null,{"$f":"IF(ISBLANK(G5),\"\",COUNTIF(Scoresheet!P:P,G5))","v":""},null,{"$f":"IF(ISBLANK(I5),\"\",COUNTIF(Scoresheet!T:T,I5))","v":""},null,{"$f":"IF(ISBLANK(K5),\"\",COUNTIF(Scoresheet!X:X,K5))","v":""},null,{"$f":"IF(ISBLANK(M5),\"\",COUNTIF(Scoresheet!AB:AB,M5))","v":""},null,{"$f":"IF(ISBLANK(O5),\"\",COUNTIF(Scoresheet!AF:AF,O5))","v":""},null,{"$f":"IF(ISBLANK(Q5),\"\",COUNTIF(Scoresheet!AJ:AJ,Q5))","v":""},null,{"$f":"IF(ISBLANK(S5),\"\",COUNTIF(Scoresheet!AN:AN,S5))","v":""},null,{"$f":"IF(ISBLANK(U5),\"\",COUNTIF(Scoresheet!AR:AR,U5))","v":""},null,{"$f":"IF(ISBLANK(W5),\"\",COUNTIF(Scoresheet!AV:AV,W5))","v":""},null,{"$f":"IF(ISBLANK(Y5),\"\",COUNTIF(Scoresheet!AZ:AZ,Y5))","v":""},null,{"$f":"IF(ISBLANK(AA5),\"\",COUNTIF(Scoresheet!BD:BD,AA5))","v":""},null,{"$f":"IF(ISBLANK(AC5),\"\",COUNTIF(Scoresheet!BH:BH,AC5))","v":""},null,{"$f":"IF(ISBLANK(AE5),\"\",COUNTIF(Scoresheet!BL:BL,AE5))","v":""},null,{"$f":"IF(ISBLANK(AG5),\"\",COUNTIF(Scoresheet!BP:BP,AG5))","v":""},null,{"$f":"IF(ISBLANK(AI5),\"\",COUNTIF(Scoresheet!BT:BT,AI5))","v":""},null,{"$f":"IF(ISBLANK(AK5),\"\",COUNTIF(Scoresheet!BX:BX,AK5))","v":""},null,{"$f":"IF(ISBLANK(AM5),\"\",COUNTIF(Scoresheet!CB:CB,AM5))","v":""}]
[null,{"$f":"IF(ISBLANK(A6),\"\",COUNTIF(Scoresheet!D:D,A6))","v":""},null,{"$f":"IF(ISBLANK(C6),\"\",COUNTIF(Scoresheet!H:H,C6))","v":""},null,{"$f":"IF(ISBLANK(E6),\"\",COUNTIF(Scoresheet!L:L,E6))","v":""},null,{"$f":"IF(ISBLANK(G6),\"\",COUNTIF(Scoresheet!P:P,G6))","v":""},null,{"$f":"IF(ISBLANK(I6),\"\",COUNTIF(Scoresheet!T:T,I6))","v":""},null,{"$f":"IF(ISBLANK(K6),\"\",COUNTIF(Scoresheet!X:X,K6))","v":""},null,{"$f":"IF(ISBLANK(M6),\"\",COUNTIF(Scoresheet!AB:AB,M6))","v":""},null,{"$f":"IF(ISBLANK(O6),\"\",COUNTIF(Scoresheet!AF:AF,O6))","v":""},null,{"$f":"IF(ISBLANK(Q6),\"\",COUNTIF(Scoresheet!AJ:AJ,Q6))","v":""},null,{"$f":"IF(ISBLANK(S6),\"\",COUNTIF(Scoresheet!AN:AN,S6))","v":""},null,{"$f":"IF(ISBLANK(U6),\"\",COUNTIF(Scoresheet!AR:AR,U6))","v":""},null,{"$f":"IF(ISBLANK(W6),\"\",COUNTIF(Scoresheet!AV:AV,W6))","v":""},null,{"$f":"IF(ISBLANK(Y6),\"\",COUNTIF(Scoresheet!AZ:AZ,Y6))","v":""},null,{"$f":"IF(ISBLANK(AA6),\"\",COUNTIF(Scoresheet!BD:BD,AA6))","v":""},null,{"$f":"IF(ISBLANK(AC6),\"\",COUNTIF(Scoresheet!BH:BH,AC6))","v":""},null,{"$f":"IF(ISBLANK(AE6),\"\",COUNTIF(Scoresheet!BL:BL,AE6))","v":""},null,{"$f":"IF(ISBLANK(AG6),\"\",COUNTIF(Scoresheet!BP:BP,AG6))","v":""},null,{"$f":"IF(ISBLANK(AI6),\"\",COUNTIF(Scoresheet!BT:BT,AI6))","v":""},null,{"$f":"IF(ISBLANK(AK6),\"\",COUNTIF(Scoresheet!BX:BX,AK6))","v":""},null,{"$f":"IF(ISBLANK(AM6),\"\",COUNTIF(Scoresheet!CB:CB,AM6))","v":""}]
[null,{"$f":"IF(ISBLANK(A7),\"\",COUNTIF(Scoresheet!D:D,A7))","v":""},null,{"$f":"IF(ISBLANK(C7),\"\",COUNTIF(Scoresheet!H:H,C7))","v":""},null,{"$f":"IF(ISBLANK(E7),\"\",COUNTIF(Scoresheet!L:L,E7))","v":""},null,{"$f":"IF(ISBLANK(G7),\"\",COUNTIF(Scoresheet!P:P,G7))","v":""},null,{"$f":"IF(ISBLANK(I7),\"\",COUNTIF(Scoresheet!T:T,I7))","v":""},null,{"$f":"IF(ISBLANK(K7),\"\",COUNTIF(Scoresheet!X:X,K7))","v":""},null,{"$f":"IF(ISBLANK(M7),\"\",COUNTIF(Scoresheet!AB:AB,M7))","v":""},null,{"$f":"IF(ISBLANK(O7),\"\",COUNTIF(Scoresheet!AF:AF,O7))","v":""},null,{"$f":"IF(ISBLANK(Q7),\"\",COUNTIF(Scoresheet!AJ:AJ,Q7))","v":""},null,{"$f":"IF(ISBLANK(S7),\"\",COUNTIF(Scoresheet!AN:AN,S7))","v":""},null,{"$f":"IF(ISBLANK(U7),\"\",COUNTIF(Scoresheet!AR:AR,U7))","v":""},null,{"$f":"IF(ISBLANK(W7),\"\",COUNTIF(Scoresheet!AV:AV,W7))","v":""},null,{"$f":"IF(ISBLANK(Y7),\"\",COUNTIF(Scoresheet!AZ:AZ,Y7))","v":""},null,{"$f":"IF(ISBLANK(AA7),\"\",COUNTIF(Scoresheet!BD:BD,AA7))","v":""},null,{"$f":"IF(ISBLANK(AC7),\"\",COUNTIF(Scoresheet!BH:BH,AC7))","v":""},null,{"$f":"IF(ISBLANK(AE7),\"\",COUNTIF(Scoresheet!BL:BL,AE7))","v":""},null,{"$f":"IF(ISBLANK(AG7),\"\",COUNTIF(Scoresheet!BP:BP,AG7))","v":""},null,{"$f":"IF(ISBLANK(AI7),\"\",COUNTIF(Scoresheet!BT:BT,AI7))","v":""},null,{"$f":"IF(ISBLANK(AK7),\"\",COUNTIF(Scoresheet!BX:BX,AK7))","v":""},null,{"$f":"IF(ISBLANK(AM7),\"\",COUNTIF(Scoresheet!CB:CB,AM7))","v":""}]
[null,{"$f":"IF(ISBLANK(A8),\"\",COUNTIF(Scoresheet!D:D,A8))","v":""},null,{"$f":"IF(ISBLANK(C8),\"\",COUNTIF(Scoresheet!H:H,C8))","v":""},null,{"$f":"IF(ISBLANK(E8),\"\",COUNTIF(Scoresheet!L:L,E8))","v":""},null,{"$f":"IF(ISBLANK(G8),\"\",COUNTIF(Scoresheet!P:P,G8))","v":""},null,{"$f":"IF(ISBLANK(I8),\"\",COUNTIF(Scoresheet!T:T,I8))","v":""},null,{"$f":"IF(ISBLANK(K8),\"\",COUNTIF(Scoresheet!X:X,K8))","v":""},null,{"$f":"IF(ISBLANK(M8),\"\",COUNTIF(Scoresheet!AB:AB,M8))","v":""},null,{"$f":"IF(ISBLANK(O8),\"\",COUNTIF(Scoresheet!AF:AF,O8))","v":""},null,{"$f":"IF(ISBLANK(Q8),\"\",COUNTIF(Scoresheet!AJ:AJ,Q8))","v":""},null,{"$f":"IF(ISBLANK(S8),\"\",COUNTIF(Scoresheet!AN:AN,S8))","v":""},null,{"$f":"IF(ISBLANK(U8),\"\",COUNTIF(Scoresheet!AR:AR,U8))","v":""},null,{"$f":"IF(ISBLANK(W8),\"\",COUNTIF(Scoresheet!AV:AV,W8))","v":""},null,{"$f":"IF(ISBLANK(Y8),\"\",COUNTIF(Scoresheet!AZ:AZ,Y8))","v":""},null,{"$f":"IF(ISBLANK(AA8),\"\",COUNTIF(Scoresheet!BD:BD,AA8))","v":""},null,{"$f":"IF(ISBLANK(AC8),\"\",COUNTIF(Scoresheet!BH:BH,AC8))","v":""},null,{"$f":"IF(ISBLANK(AE8),\"\",COUNTIF(Scoresheet!BL:BL,AE8))","v":""},null,{"$f":"IF(ISBLANK(AG8),\"\",COUNTIF(Scoresheet!BP:BP,AG8))","v":""},null,{"$f":"IF(ISBLANK(AI8),\"\",COUNTIF(Scoresheet!BT:BT,AI8))","v":""},null,{"$f":"IF(ISBLANK(AK8),\"\",COUNTIF(Scoresheet!BX:BX,AK8))","v":""},null,{"$f":"IF(ISBLANK(AM8),\"\",COUNTIF(Scoresheet!CB:CB,AM8))","v":""}]
[null,{"$f":"IF(ISBLANK(A9),\"\",COUNTIF(Scoresheet!D:D,A9))","v":""},null,{"$f":"IF(ISBLANK(C9),\"\",COUNTIF(Scoresheet!H:H,C9))","v":""},null,{"$f":"IF(ISBLANK(E9),\"\",COUNTIF(Scoresheet!L:L,E9))","v":""},null,{"$f":"IF(ISBLANK(G9),\"\",COUNTIF(Scoresheet!P:P,G9))","v":""},null,{"$f":"IF(ISBLANK(I9),\"\",COUNTIF(Scoresheet!T:T,I9))","v":""},null,{"$f":"IF(ISBLANK(K9),\"\",COUNTIF(Scoresheet!X:X,K9))","v":""},null,{"$f":"IF(ISBLANK(M9),\"\",COUNTIF(Scoresheet!AB:AB,M9))","v":""},null,{"$f":"IF(ISBLANK(O9),\"\",COUNTIF(Scoresheet!AF:AF,O9))","v":""},null,{"$f":"IF(ISBLANK(Q9),\"\",COUNTIF(Scoresheet!AJ:AJ,Q9))","v":""},null,{"$f":"IF(ISBLANK(S9),\"\",COUNTIF(Scoresheet!AN:AN,S9))","v":""},null,{"$f":"IF(ISBLANK(U9),\"\",COUNTIF(Scoresheet!AR:AR,U9))","v":""},null,{"$f":"IF(ISBLANK(W9),\"\",COUNTIF(Scoresheet!AV:AV,W9))","v":""},null,{"$f":"IF(ISBLANK(Y9),\"\",COUNTIF(Scoresheet!AZ:AZ,Y9))","v":""},null,{"$f":"IF(ISBLANK(AA9),\"\",COUNTIF(Scoresheet!BD:BD,AA9))","v":""},null,{"$f":"IF(ISBLANK(AC9),\"\",COUNTIF(Scoresheet!BH:BH,AC9))","v":""},null,{"$f":"IF(ISBLANK(AE9),\"\",COUNTIF(Scoresheet!BL:BL,AE9))","v":""},null,{"$f":"IF(ISBLANK(AG9),\"\",COUNTIF(Scoresheet!BP:BP,AG9))","v":""},null,{"$f":"IF(ISBLANK(AI9),\"\",COUNTIF(Scoresheet!BT:BT,AI9))","v":""},null,{"$f":"IF(ISBLANK(AK9),\"\",COUNTIF(Scoresheet!BX:BX,AK9))","v":""},null,{"$f":"IF(ISBLANK(AM9),\"\",COUNTIF(Scoresheet!CB:CB,AM9))","v":""}]
[null,{"$f":"IF(ISBLANK(A10),\"\",COUNTIF(Scoresheet!D:D,A10))","v":""},null,{"$f":"IF(ISBLANK(C10),\"\",COUNTIF(Scoresheet!H:H,C10))","v":""},null,{"$f":"IF(ISBLANK(E10),\"\",COUNTIF(Scoresheet!L:L,E10))","v":""},null,{"$f":"IF(ISBLANK(G10),\"\",COUNTIF(Scoresheet!P:P,G10))","v":""},null,{"$f":"IF(ISBLANK(I10),\"\",COUNTIF(Scoresheet!T:T,I10))","v":""},null,{"$f":"IF(ISBLANK(K10),\"\",COUNTIF(Scoresheet!X:X,K10))","v":""},null,{"$f":"IF(ISBLANK(M10),\"\",COUNTIF(Scoresheet!AB:AB,M10))","v":""},null,{"$f":"IF(ISBLANK(O10),\"\",COUNTIF(Scoresheet!AF:AF,O10))","v":""},null,{"$f":"IF(ISBLANK(Q10),\"\",COUNTIF(Scoresheet!AJ:AJ,Q10))","v":""},null,{"$f":"IF(ISBLANK(S10),\"\",COUNTIF(Scoresheet!AN:AN,S10))","v":""},null,{"$f":"IF(ISBLANK(U10),\"\",COUNTIF(Scoresheet!AR:AR,U10))","v":""},null,{"$f":"IF(ISBLANK(W10),\"\",COUNTIF(Scoresheet!AV:AV,W10))","v":""},null,{"$f":"IF(ISBLANK(Y10),\"\",COUNTIF(Scoresheet!AZ:AZ,Y10))","v":""},null,{"$f":"IF(ISBLANK(AA10),\"\",COUNTIF(Scoresheet!BD:BD,AA10))","v":""},null,{"$f":"IF(ISBLANK(AC10),\"\",COUNTIF(Scoresheet!BH:BH,AC10))","v":""},null,{"$f":"IF(ISBLANK(AE10),\"\",COUNTIF(Scoresheet!BL:BL,AE10))","v":""},null,{"$f":"IF(ISBLANK(AG10),\"\",COUNTIF(Scoresheet!BP:BP,AG10))","v":""},null,{"$f":"IF(ISBLANK(AI10),\"\",COUNTIF(Scoresheet!BT:BT,AI10))","v":""},null,{"$f":"IF(ISBLANK(AK10),\"\",COUNTIF(Scoresheet!BX:BX,AK10))","v":""},null,{"$f":"IF(ISBLANK(AM10),\"\",COUNTIF(Scoresheet!CB:CB,AM10))","v":""}]
[null,{"$f":"IF(ISBLANK(A11),\"\",COUNTIF(Scoresheet!D:D,A11))","v":""},null,{"$f":"IF(ISBLANK(C11),\"\",COUNTIF(Scoresheet!H:H,C11))","v":""},null,{"$f":"IF(ISBLANK(E11),\"\",COUNTIF(Scoresheet!L:L,E11))","v":""},null,{"$f":"IF(ISBLANK(G11),\"\",COUNTIF(Scoresheet!P:P,G11))","v":""},null,{"$f":"IF(ISBLANK(I11),\"\",COUNTIF(Scoresheet!T:T,I11))","v":""},null,{"$f":"IF(ISBLANK(K11),\"\",COUNTIF(Scoresheet!X:X,K11))","v":""},null,{"$f":"IF(ISBLANK(M11),\"\",COUNTIF(Scoresheet!AB:AB,M11))","v":""},null,{"$f":"IF(ISBLANK(O11),\"\",COUNTIF(Scoresheet!AF:AF,O11))","v":""},null,{"$f":"IF(ISBLANK(Q11),\"\",COUNTIF(Scoresheet!AJ:AJ,Q11))","v":""},null,{"$f":"IF(ISBLANK(S11),\"\",COUNTIF(Scoresheet!AN:AN,S11))","v":""},null,{"$f":"IF(ISBLANK(U11),\"\",COUNTIF(Scoresheet!AR:AR,U11))","v":""},null,{"$f":"IF(ISBLANK(W11),\"\",COUNTIF(Scoresheet!AV:AV,W11))","v":""},null,{"$f":"IF(ISBLANK(Y11),\"\",COUNTIF(Scoresheet!AZ:AZ,Y11))","v":""},null,{"$f":"IF(ISBLANK(AA11),\"\",COUNTIF(Scoresheet!BD:BD,AA11))","v":""},null,{"$f":"IF(ISBLANK(AC11),\"\",COUNTIF(Scoresheet!BH:BH,AC11))","v":""},null,{"$f":"IF(ISBLANK(AE11),\"\",COUNTIF(Scoresheet!BL:BL,AE11))","v":""},null,{"$f":"IF(ISBLANK(AG11),\"\",COUNTIF(Scoresheet!BP:BP,AG11))","v":""},null,{"$f":"IF(ISBLANK(AI11),\"\",COUNTIF(Scoresheet!BT:BT,AI11))","v":""},null,{"$f":"IF(ISBLANK(AK11),\"\",COUNTIF(Scoresheet!BX:BX,AK11))","v":""},null,{"$f":"IF(ISBLANK(AM11),\"\",COUNTIF(Scoresheet!CB:CB,AM11))","v":""}]
[null,{"$f":"IF(ISBLANK(A12),\"\",COUNTIF(Scoresheet!D:D,A12))","v":""},null,{"$f":"IF(ISBLANK(C12),\"\",COUNTIF(Scoresheet!H:H,C12))","v":""},null,{"$f":"IF(ISBLANK(E12),\"\",COUNTIF(Scoresheet!L:L,E12))","v":""},null,{"$f":"IF(ISBLANK(G12),\"\",COUNTIF(Scoresheet!P:P,G12))","v":""},null,{"$f":"IF(ISBLANK(I12),\"\",COUNTIF(Scoresheet!T:T,I12))","v":""},null,{"$f":"IF(ISBLANK(K12),\"\",COUNTIF(Scoresheet!X:X,K12))","v":""},null,{"$f":"IF(ISBLANK(M12),\"\",COUNTIF(Scoresheet!AB:AB,M12))","v":""},null,{"$f":"IF(ISBLANK(O12),\"\",COUNTIF(Scoresheet!AF:AF,O12))","v":""},null,{"$f":"IF(ISBLANK(Q12),\"\",COUNTIF(Scoresheet!AJ:AJ,Q12))","v":""},null,{"$f":"IF(ISBLANK(S12),\"\",COUNTIF(Scoresheet!AN:AN,S12))","v":""},null,{"$f":"IF(ISBLANK(U12),\"\",COUNTIF(Scoresheet!AR:AR,U12))","v":""},null,{"$f":"IF(ISBLANK(W12),\"\",COUNTIF(Scoresheet!AV:AV,W12))","v":""},null,{"$f":"IF(ISBLANK(Y12),\"\",COUNTIF(Scoresheet!AZ:AZ,Y12))","v":""},null,{"$f":"IF(ISBLANK(AA12),\"\",COUNTIF(Scoresheet!BD:BD,AA12))","v":""},null,{"$f":"IF(ISBLANK(AC12),\"\",COUNTIF(Scoresheet!BH:BH,AC12))","v":""},null,{"$f":"IF(ISBLANK(AE12),\"\",COUNTIF(Scoresheet!BL:BL,AE12))","v":""},null,{"$f":"IF(ISBLANK(AG12),\"\",COUNTIF(Scoresheet!BP:BP,AG12))","v":""},null,{"$f":"IF(ISBLANK(AI12),\"\",COUNTIF(Scoresheet!BT:BT,AI12))","v":""},null,{"$f":"IF(ISBLANK(AK12),\"\",COUNTIF(Scoresheet!BX:BX,AK12))","v":""},null,{"$f":"IF(ISBLANK(AM12),\"\",COUNTIF(Scoresheet!CB:CB,AM12))","v":""}]
[null,{"$f":"IF(ISBLANK(A13),\"\",COUNTIF(Scoresheet!D:D,A13))","v":""},null,{"$f":"IF(ISBLANK(C13),\"\",COUNTIF(Scoresheet!H:H,C13))","v":""},null,{"$f":"IF(ISBLANK(E13),\"\",COUNTIF(Scoresheet!L:L,E13))","v":""},null,{"$f":"IF(ISBLANK(G13),\"\",COUNTIF(Scoresheet!P:P,G13))","v":""},null,{"$f":"IF(ISBLANK(I13),\"\",COUNTIF(Scoresheet!T:T,I13))","v":""},null,{"$f":"IF(ISBLANK(K13),\"\",COUNTIF(Scoresheet!X:X,K13))","v":""},null,{"$f":"IF(ISBLANK(M13),\"\",COUNTIF(Scoresheet!AB:AB,M13))","v":""},null,{"$f":"IF(ISBLANK(O13),\"\",COUNTIF(Scoresheet!AF:AF,O13))","v":""},null,{"$f":"IF(ISBLANK(Q13),\"\",COUNTIF(Scoresheet!AJ:AJ,Q13))","v":""},null,{"$f":"IF(ISBLANK(S13),\"\",COUNTIF(Scoresheet!AN:AN,S13))","v":""},null,{"$f":"IF(ISBLANK(U13),\"\",COUNTIF(Scoresheet!AR:AR,U13))","v":""},null,{"$f":"IF(ISBLANK(W13),\"\",COUNTIF(Scoresheet!AV:AV,W13))","v":""},null,{"$f":"IF(ISBLANK(Y13),\"\",COUNTIF(Scoresheet!AZ:AZ,Y13))","v":""},null,{"$f":"IF(ISBLANK(AA13),\"\",COUNTIF(Scoresheet!BD:BD,AA13))","v":""},null,{"$f":"IF(ISBLANK(AC13),\"\",COUNTIF(Scoresheet!BH:BH,AC13))","v":""},null,{"$f":"IF(ISBLANK(AE13),\"\",COUNTIF(Scoresheet!BL:BL,AE13))","v":""},null,{"$f":"IF(ISBLANK(AG13),\"\",COUNTIF(Scoresheet!BP:BP,AG13))","v":""},null,{"$f":"IF(ISBLANK(AI13),\"\",COUNTIF(Scoresheet!BT:BT,AI13))","v":""},null,{"$f":"IF(ISBLANK(AK13),\"\",COUNTIF(Scoresheet!BX:BX,AK13))","v":""},null,{"$f":"IF(ISBLANK(AM13),\"\",COUNTIF(Scoresheet!CB:CB,AM13))","v":""}]
[null,{"$f":"IF(ISBLANK(A14),\"\",COUNTIF(Scoresheet!D:D,A14))","v":""},null,{"$f":"IF(ISBLANK(C14),\"\",COUNTIF(Scoresheet!H:H,C14))","v":""},null,{"$f":"IF(ISBLANK(E14),\"\",COUNTIF(Scoresheet!L:L,E14))","v":""},null,{"$f":"IF(ISBLANK(G14),\"\",COUNTIF(Scoresheet!P:P,G14))","v":""},null,{"$f":"IF(ISBLANK(I14),\"\",COUNTIF(Scoresheet!T:T,I14))","v":""},null,{"$f":"IF(ISBLANK(K14),\"\",COUNTIF(Scoresheet!X:X,K14))","v":""},null,{"$f":"IF(ISBLANK(M14),\"\",COUNTIF(Scoresheet!AB:AB,M14))","v":""},null,{"$f":"IF(ISBLANK(O14),\"\",COUNTIF(Scoresheet!AF:AF,O14))","v":""},null,{"$f":"IF(ISBLANK(Q14),\"\",COUNTIF(Scoresheet!AJ:AJ,Q14))","v":""},null,{"$f":"IF(ISBLANK(S14),\"\",COUNTIF(Scoresheet!AN:AN,S14))","v":""},null,{"$f":"IF(ISBLANK(U14),\"\",COUNTIF(Scoresheet!AR:AR,U14))","v":""},null,{"$f":"IF(ISBLANK(W14),\"\",COUNTIF(Scoresheet!AV:AV,W14))","v":""},null,{"$f":"IF(ISBLANK(Y14),\"\",COUNTIF(Scoresheet!AZ:AZ,Y14))","v":""},null,{"$f":"IF(ISBLANK(AA14),\"\",COUNTIF(Scoresheet!BD:BD,AA14))","v":""},null,{"$f":"IF(ISBLANK(AC14),\"\",COUNTIF(Scoresheet!BH:BH,AC14))","v":""},null,{"$f":"IF(ISBLANK(AE14),\"\",COUNTIF(Scoresheet!BL:BL,AE14))","v":""},null,{"$f":"IF(ISBLANK(AG14),\"\",COUNTIF(Scoresheet!BP:BP,AG14))","v":""},null,{"$f":"IF(ISBLANK(AI14),\"\",COUNTIF(Scoresheet!BT:BT,AI14))","v":""},null,{"$f":"IF(ISBLANK(AK14),\"\",COUNTIF(Scoresheet!BX:BX,AK14))","v":""},null,{"$f":"IF(ISBLANK(AM14),\"\",COUNTIF(Scoresheet!CB:CB,AM14))","v":""}]
[null,{"$f":"IF(ISBLANK(A15),\"\",COUNTIF(Scoresheet!D:D,A15))","v":""},null,{"$f":"IF(ISBLANK(C15),\"\",COUNTIF(Scoresheet!H:H,C15))","v":""},null,{"$f":"IF(ISBLANK(E15),\"\",COUNTIF(Scoresheet!L:L,E15))","v":""},null,{"$f":"IF(ISBLANK(G15),\"\",COUNTIF(Scoresheet!P:P,G15))","v":""},null,{"$f":"IF(ISBLANK(I15),\"\",COUNTIF(Scoresheet!T:T,I15))","v":""},null,{"$f":"IF(ISBLANK(K15),\"\",COUNTIF(Scoresheet!X:X,K15))","v":""},null,{"$f":"IF(ISBLANK(M15),\"\",COUNTIF(Scoresheet!AB:AB,M15))","v":""},null,{"$f":"IF(ISBLANK(O15),\"\",COUNTIF(Scoresheet!AF:AF,O15))","v":""},null,{"$f":"IF(ISBLANK(Q15),\"\",COUNTIF(Scoresheet!AJ:AJ,Q15))","v":""},null,{"$f":"IF(ISBLANK(S15),\"\",COUNTIF(Scoresheet!AN:AN,S15))","v":""},null,{"$f":"IF(ISBLANK(U15),\"\",COUNTIF(Scoresheet!AR:AR,U15))","v":""},null,{"$f":"IF(ISBLANK(W15),\"\",COUNTIF(Scoresheet!AV:AV,W15))","v":""},null,{"$f":"IF(ISBLANK(Y15),\"\",COUNTIF(Scoresheet!AZ:AZ,Y15))","v":""},null,{"$f":"IF(ISBLANK(AA15),\"\",COUNTIF(Scoresheet!BD:BD,AA15))","v":""},null,{"$f":"IF(ISBLANK(AC15),\"\",COUNTIF(Scoresheet!BH:BH,AC15))","v":""},null,{"$f":"IF(ISBLANK(AE15),\"\",COUNTIF(Scoresheet!BL:BL,AE15))","v":""},null,{"$f":"IF(ISBLANK(AG15),\"\",COUNTIF(Scoresheet!BP:BP,AG15))","v":""},null,{"$f":"IF(ISBLANK(AI15),\"\",COUNTIF(Scoresheet!BT:BT,AI15))","v":""},null,{"$f":"IF(ISBLANK(AK15),\"\",COUNTIF(Scoresheet!BX:BX,AK15))","v":""},null,{"$f":"IF(ISBLANK(AM15),\"\",COUNTIF(Scoresheet!CB:CB,AM15))","v":""}]
[null,{"$f":"IF(ISBLANK(A16),\"\",COUNTIF(Scoresheet!D:D,A16))","v":""},null,{"$f":"IF(ISBLANK(C16),\"\",COUNTIF(Scoresheet!H:H,C16))","v":""},null,{"$f":"IF(ISBLANK(E16),\"\",COUNTIF(Scoresheet!L:L,E16))","v":""},null,{"$f":"IF(ISBLANK(G16),\"\",COUNTIF(Scoresheet!P:P,G16))","v":""},null,{"$f":"IF(ISBLANK(I16),\"\",COUNTIF(Scoresheet!T:T,I16))","v":""},null,{"$f":"IF(ISBLANK(K16),\"\",COUNTIF(Scoresheet!X:X,K16))","v":""},null,{"$f":"IF(ISBLANK(M16),\"\",COUNTIF(Scoresheet!AB:AB,M16))","v":""},null,{"$f":"IF(ISBLANK(O16),\"\",COUNTIF(Scoresheet!AF:AF,O16))","v":""},null,{"$f":"IF(ISBLANK(Q16),\"\",COUNTIF(Scoresheet!AJ:AJ,Q16))","v":""},null,{"$f":"IF(ISBLANK(S16),\"\",COUNTIF(Scoresheet!AN:AN,S16))","v":""},null,{"$f":"IF(ISBLANK(U16),\"\",COUNTIF(Scoresheet!AR:AR,U16))","v":""},null,{"$f":"IF(ISBLANK(W16),\"\",COUNTIF(Scoresheet!AV:AV,W16))","v":""},null,{"$f":"IF(ISBLANK(Y16),\"\",COUNTIF(Scoresheet!AZ:AZ,Y16))","v":""},null,{"$f":"IF(ISBLANK(AA16),\"\",COUNTIF(Scoresheet!BD:BD,AA16))","v":""},null,{"$f":"IF(ISBLANK(AC16),\"\",COUNTIF(Scoresheet!BH:BH,AC16))","v":""},null,{"$f":"IF(ISBLANK(AE16),\"\",COUNTIF(Scoresheet!BL:BL,AE16))","v":""},null,{"$f":"IF(ISBLANK(AG16),\"\",COUNTIF(Scoresheet!BP:BP,AG16))","v":""},null,{"$f":"IF(ISBLANK(AI16),\"\",COUNTIF(Scoresheet!BT:BT,AI16))","v":""},null,{"$f":"IF(ISBLANK(AK16),\"\",COUNTIF(Scoresheet!BX:BX,AK16))","v":""},null,{"$f":"IF(ISBLANK(AM16),\"\",COUNTIF(Scoresheet!CB:CB,AM16))","v":""}]
[null,{"$f":"IF(ISBLANK(A17),\"\",COUNTIF(Scoresheet!D:D,A17))","v":""},null,{"$f":"IF(ISBLANK(C17),\"\",COUNTIF(Scoresheet!H:H,C17))","v":""},null,{"$f":"IF(ISBLANK(E17),\"\",COUNTIF(Scoresheet!L:L,E17))","v":""},null,{"$f":"IF(ISBLANK(G17),\"\",COUNTIF(Scoresheet!P:P,G17))","v":""},null,{"$f":"IF(ISBLANK(I17),\"\",COUNTIF(Scoresheet!T:T,I17))","v":""},null,{"$f":"IF(ISBLANK(K17),\"\",COUNTIF(Scoresheet!X:X,K17))","v":""},null,{"$f":"IF(ISBLANK(M17),\"\",COUNTIF(Scoresheet!AB:AB,M17))","v":""},null,{"$f":"IF(ISBLANK(O17),\"\",COUNTIF(Scoresheet!AF:AF,O17))","v":""},null,{"$f":"IF(ISBLANK(Q17),\"\",COUNTIF(Scoresheet!AJ:AJ,Q17))","v":""},null,{"$f":"IF(ISBLANK(S17),\"\",COUNTIF(Scoresheet!AN:AN,S17))","v":""},null,{"$f":"IF(ISBLANK(U17),\"\",COUNTIF(Scoresheet!AR:AR,U17))","v":""},null,{"$f":"IF(ISBLANK(W17),\"\",COUNTIF(Scoresheet!AV:AV,W17))","v":""},null,{"$f":"IF(ISBLANK(Y17),\"\",COUNTIF(Scoresheet!AZ:AZ,Y17))","v":""},null,{"$f":"IF(ISBLANK(AA17),\"\",COUNTIF(Scoresheet!BD:BD,AA17))","v":""},null,{"$f":"IF(ISBLANK(AC17),\"\",COUNTIF(Scoresheet!BH:BH,AC17))","v":""},null,{"$f":"IF(ISBLANK(AE17),\"\",COUNTIF(Scoresheet!BL:BL,AE17))","v":""},null,{"$f":"IF(ISBLANK(AG17),\"\",COUNTIF(Scoresheet!BP:BP,AG17))","v":""},null,{"$f":"IF(ISBLANK(AI17),\"\",COUNTIF(Scoresheet!BT:BT,AI17))","v":""},null,{"$f":"IF(ISBLANK(AK17),\"\",COUNTIF(Scoresheet!BX:BX,AK17))","v":""},null,{"$f":"IF(ISBLANK(AM17),\"\",COUNTIF(Scoresheet!CB:CB,AM17))","v":""}]
[null,{"$f":"IF(ISBLANK(A18),\"\",COUNTIF(Scoresheet!D:D,A18))","v":""},null,{"$f":"IF(ISBLANK(C18),\"\",COUNTIF(Scoresheet!H:H,C18))","v":""},null,{"$f":"IF(ISBLANK(E18),\"\",COUNTIF(Scoresheet!L:L,E18))","v":""},null,{"$f":"IF(ISBLANK(G18),\"\",COUNTIF(Scoresheet!P:P,G18))","v":""},null,{"$f":"IF(ISBLANK(I18),\"\",COUNTIF(Scoresheet!T:T,I18))","v":""},null,{"$f":"IF(ISBLANK(K18),\"\",COUNTIF(Scoresheet!X:X,K18))","v":""},null,{"$f":"IF(ISBLANK(M18),\"\",COUNTIF(Scoresheet!AB:AB,M18))","v":""},null,{"$f":"IF(ISBLANK(O18),\"\",COUNTIF(Scoresheet!AF:AF,O18))","v":""},null,{"$f":"IF(ISBLANK(Q18),\"\",COUNTIF(Scoresheet!AJ:AJ,Q18))","v":""},null,{"$f":"IF(ISBLANK(S18),\"\",COUNTIF(Scoresheet!AN:AN,S18))","v":""},null,{"$f":"IF(ISBLANK(U18),\"\",COUNTIF(Scoresheet!AR:AR,U18))","v":""},null,{"$f":"IF(ISBLANK(W18),\"\",COUNTIF(Scoresheet!AV:AV,W18))","v":""},null,{"$f":"IF(ISBLANK(Y18),\"\",COUNTIF(Scoresheet!AZ:AZ,Y18))","v":""},null,{"$f":"IF(ISBLANK(AA18),\"\",COUNTIF(Scoresheet!BD:BD,AA18))","v":""},null,{"$f":"IF(ISBLANK(AC18),\"\",COUNTIF(Scoresheet!BH:BH,AC18))","v":""},null,{"$f":"IF(ISBLANK(AE18),\"\",COUNTIF(Scoresheet!BL:BL,AE18))","v":""},null,{"$f":"IF(ISBLANK(AG18),\"\",COUNTIF(Scoresheet!BP:BP,AG18))","v":""},null,{"$f":"IF(ISBLANK(AI18),\"\",COUNTIF(Scoresheet!BT:BT,AI18))","v":""},null,{"$f":"IF(ISBLANK(AK18),\"\",COUNTIF(Scoresheet!BX:BX,AK18))","v":""},null,{"$f":"IF(ISBLANK(AM18),\"\",COUNTIF(Scoresheet!CB:CB,AM18))","v":""}]
[null,{"$f":"IF(ISBLANK(A19),\"\",COUNTIF(Scoresheet!D:D,A19))","v":""},null,{"$f":"IF(ISBLANK(C19),\"\",COUNTIF(Scoresheet!H:H,C19))","v":""},null,{"$f":"IF(ISBLANK(E19),\"\",COUNTIF(Scoresheet!L:L,E19))","v":""},null,{"$f":"IF(ISBLANK(G19),\"\",COUNTIF(Scoresheet!P:P,G19))","v":""},null,{"$f":"IF(ISBLANK(I19),\"\",COUNTIF(Scoresheet!T:T,I19))","v":""},null,{"$f":"IF(ISBLANK(K19),\"\",COUNTIF(Scoresheet!X:X,K19))","v":""},null,{"$f":"IF(ISBLANK(M19),\"\",COUNTIF(Scoresheet!AB:AB,M19))","v":""},null,{"$f":"IF(ISBLANK(O19),\"\",COUNTIF(Scoresheet!AF:AF,O19))","v":""},null,{"$f":"IF(ISBLANK(Q19),\"\",COUNTIF(Scoresheet!AJ:AJ,Q19))","v":""},null,{"$f":"IF(ISBLANK(S19),\"\",COUNTIF(Scoresheet!AN:AN,S19))","v":""},null,{"$f":"IF(ISBLANK(U19),\"\",COUNTIF(Scoresheet!AR:AR,U19))","v":""},null,{"$f":"IF(ISBLANK(W19),\"\",COUNTIF(Scoresheet!AV:AV,W19))","v":""},null,{"$f":"IF(ISBLANK(Y19),\"\",COUNTIF(Scoresheet!AZ:AZ,Y19))","v":""},null,{"$f":"IF(ISBLANK(AA19),\"\",COUNTIF(Scoresheet!BD:BD,AA19))","v":""},null,{"$f":"IF(ISBLANK(AC19),\"\",COUNTIF(Scoresheet!BH:BH,AC19))","v":""},null,{"$f":"IF(ISBLANK(AE19),\"\",COUNTIF(Scoresheet!BL:BL,AE19))","v":""},null,{"$f":"IF(ISBLANK(AG19),\"\",COUNTIF(Scoresheet!BP:BP,AG19))","v":""},null,{"$f":"IF(ISBLANK(AI19),\"\",COUNTIF(Scoresheet!BT:BT,AI19))","v":""},null,{"$f":"IF(ISBLANK(AK19),\"\",COUNTIF(Scoresheet!BX:BX,AK19))","v":""},null,{"$f":"IF(ISBLANK(AM19),\"\",COUNTIF(Scoresheet!CB:CB,AM19))","v":""}]
[null,{"$f":"IF(ISBLANK(A20),\"\",COUNTIF(Scoresheet!D:D,A20))","v":""},null,{"$f":"IF(ISBLANK(C20),\"\",COUNTIF(Scoresheet!H:H,C20))","v":""},null,{"$f":"IF(ISBLANK(E20),\"\",COUNTIF(Scoresheet!L:L,E20))","v":""},null,{"$f":"IF(ISBLANK(G20),\"\",COUNTIF(Scoresheet!P:P,G20))","v":""},null,{"$f":"IF(ISBLANK(I20),\"\",COUNTIF(Scoresheet!T:T,I20))","v":""},null,{"$f":"IF(ISBLANK(K20),\"\",COUNTIF(Scoresheet!X:X,K20))","v":""},null,{"$f":"IF(ISBLANK(M20),\"\",COUNTIF(Scoresheet!AB:AB,M20))","v":""},null,{"$f":"IF(ISBLANK(O20),\"\",COUNTIF(Scoresheet!AF:AF,O20))","v":""},null,{"$f":"IF(ISBLANK(Q20),\"\",COUNTIF(Scoresheet!AJ:AJ,Q20))","v":""},null,{"$f":"IF(ISBLANK(S20),\"\",COUNTIF(Scoresheet!AN:AN,S20))","v":""},null,{"$f":"IF(ISBLANK(U20),\"\",COUNTIF(Scoresheet!AR:AR,U20))","v":""},null,{"$f":"IF(ISBLANK(W20),\"\",COUNTIF(Scoresheet!AV:AV,W20))","v":""},null,{"$f":"IF(ISBLANK(Y20),\"\",COUNTIF(Scoresheet!AZ:AZ,Y20))","v":""},null,{"$f":"IF(ISBLANK(AA20),\"\",COUNTIF(Scoresheet!BD:BD,AA20))","v":""},null,{"$f":"IF(ISBLANK(AC20),\"\",COUNTIF(Scoresheet!BH:BH,AC20))","v":""},null,{"$f":"IF(ISBLANK(AE20),\"\",COUNTIF(Scoresheet!BL:BL,AE20))","v":""},null,{"$f":"IF(ISBLANK(AG20),\"\",COUNTIF(Scoresheet!BP:BP,AG20))","v":""},null,{"$f":"IF(ISBLANK(AI20),\"\",COUNTIF(Scoresheet!BT:BT,AI20))","v":""},null,{"$f":"IF(ISBLANK(AK20),\"\",COUNTIF(Scoresheet!BX:BX,AK20))","v":""},null,{"$f":"IF(ISBLANK(AM20),\"\",COUNTIF(Scoresheet!CB:CB,AM20))","v":""}]
[null,{"$f":"IF(ISBLANK(A21),\"\",COUNTIF(Scoresheet!D:D,A21))","v":""},null,{"$f":"IF(ISBLANK(C21),\"\",COUNTIF(Scoresheet!H:H,C21))","v":""},null,{"$f":"IF(ISBLANK(E21),\"\",COUNTIF(Scoresheet!L:L,E21))","v":""},null,{"$f":"IF(ISBLANK(G21),\"\",COUNTIF(Scoresheet!P:P,G21))","v":""},null,{"$f":"IF(ISBLANK(I21),\"\",COUNTIF(Scoresheet!T:T,I21))","v":""},null,{"$f":"IF(ISBLANK(K21),\"\",COUNTIF(Scoresheet!X:X,K21))","v":""},null,{"$f":"IF(ISBLANK(M21),\"\",COUNTIF(Scoresheet!AB:AB,M21))","v":""},null,{"$f":"IF(ISBLANK(O21),\"\",COUNTIF(Scoresheet!AF:AF,O21))","v":""},null,{"$f":"IF(ISBLANK(Q21),\"\",COUNTIF(Scoresheet!AJ:AJ,Q21))","v":""},null,{"$f":"IF(ISBLANK(S21),\"\",COUNTIF(Scoresheet!AN:AN,S21))","v":""},null,{"$f":"IF(ISBLANK(U21),\"\",COUNTIF(Scoresheet!AR:AR,U21))","v":""},null,{"$f":"IF(ISBLANK(W21),\"\",COUNTIF(Scoresheet!AV:AV,W21))","v":""},null,{"$f":"IF(ISBLANK(Y21),\"\",COUNTIF(Scoresheet!AZ:AZ,Y21))","v":""},null,{"$f":"IF(ISBLANK(AA21),\"\",COUNTIF(Scoresheet!BD:BD,AA21))","v":""},null,{"$f":"IF(ISBLANK(AC21),\"\",COUNTIF(Scoresheet!BH:BH,AC21))","v":""},null,{"$f":"IF(ISBLANK(AE21),\"\",COUNTIF(Scoresheet!BL:BL,AE21))","v":""},null,{"$f":"IF(ISBLANK(AG21),\"\",COUNTIF(Scoresheet!BP:BP,AG21))","v":""},null,{"$f":"IF(ISBLANK(AI21),\"\",COUNTIF(Scoresheet!BT:BT,AI21))","v":""},null,{"$f":"IF(ISBLANK(AK21),\"\",COUNTIF(Scoresheet!BX:BX,AK21))","v":""},null,{"$f":"IF(ISBLANK(AM21),\"\",COUNTIF(Scoresheet!CB:CB,AM21))","v":""}]
[]
["WRONG",{"$f":"B25+5","v":5},"WRONG",{"$f":"D25+5","v":5},"WRONG",{"$f":"F25+5","v":5},"WRONG",{"$f":"H25+5","v":5},"WRONG",{"$f":"J25+5","v":5},"WRONG",{"$f":"L25+5","v":5},"WRONG",{"$f":"N25+5","v":5},"WRONG",{"$f":"P25+5","v":5},"WRONG",{"$f":"R25+5","v":5},"WRONG",{"$f":"T25+5","v":5},"WRONG",{"$f":"V25+5","v":5},"WRONG",{"$f":"X25+5","v":5},"WRONG",{"$f":"Z25+5","v":5},"WRONG",{"$f":"AB25+5","v":5},"WRONG",{"$f":"AD25+5","v":5},"WRONG",{"$f":"AF25+5","v":5},"WRONG",{"$f":"AH25+5","v":5},"WRONG",{"$f":"AJ25+5","v":5},"WRONG",{"$f":"AL25+5","v":5},"WRONG",{"$f":"AN25+5","v":5}]
["PASS",0,"PASS",0,"PASS",0,"PASS",0,"PASS",0,"PASS",0,"PASS",0,"PASS",0,"PASS",0,"PASS",0,"PASS",0,"PASS",0,"PASS",0,"PASS",0,"PASS",0,"PASS",0,"PASS",0,"PASS",0,"PASS",0,"PASS",0]
["SHEEP",{"$f":"MAX(B2:B22)","v":0},"SHEEP",{"$f":"MAX(D2:D22)","v":0},"SHEEP",{"$f":"MAX(F2:F22)","v":0},"SHEEP",{"$f":"MAX(H2:H22)","v":0},"SHEEP",{"$f":"MAX(J2:J22)","v":0},"SHEEP",{"$f":"MAX(L2:L22)","v":0},"SHEEP",{"$f":"MAX(N2:N22)","v":0},"SHEEP",{"$f":"MAX(P2:P22)","v":0},"SHEEP",{"$f":"MAX(R2:R22)","v":0},"SHEEP",{"$f":"MAX(T2:T22)","v":0},"SHEEP",{"$f":"MAX(V2:V22)","v":0},"SHEEP",{"$f":"MAX(X2:X22)","v":0},"SHEEP",{"$f":"MAX(Z2:Z22)","v":0},"SHEEP",{"$f":"MAX(AB2:AB22)","v":0},"SHEEP",{"$f":"MAX(AD2:AD22)","v":0},"SHEEP",{"$f":"MAX(AF2:AF22)","v":0},"SHEEP",{"$f":"MAX(AH2:AH22)","v":0},"SHEEP",{"$f":"MAX(AJ2:AJ22)","v":0},"SHEEP",{"$f":"MAX(AL2:AL22)","v":0},"SHEEP",{"$f":"MAX(AN2:AN22)","v":0}]

{"sheet":"Backup 2","index":3,"n_rows":43,"n_cols":64,"rows_kept":43,"cut":false,"hidden":true,"merged":[[0,1,0,3],[0,4,0,11],[0,12,0,23],[0,24,0,39],[0,40,0,59]]}
[null,"Question 1 – VP -> Prez",null,null,"Question 2 – Greek letters",null,null,null,null,null,null,null,"Question 3 – Shakepseare plays",null,null,null,null,null,null,null,null,null,null,null,"Question 4 – Best Pictures",null,null,null,null,null,null,null,null,null,null,null,null,null,null,null,"Question 5 – African countries",null,null,null,null,null,null,null,null,null,null,null,null,null,null,null,null,null,null,null,null,null,null,5]
["Player",3,"Resp","Total",2,"Resp","Pts","Total",4,"Resp","Pts","Total",1,"Resp","Pts","Total",3,"Resp","Pts","Total",5,"Resp","Pts","Total",0,"Resp","Pts","Total",2,"Resp","Pts","Total",4,"Resp","Pts","Total",6,"Resp","Pts","Total",-1,"Resp","Pts","Total",1,"Resp","Pts","Total",3,"Resp","Pts","Total",5,"Resp","Pts","Total",7,"Resp","Pts","Total"]
["kingrat47","Martin Van Buren",{"$f":"IF(B3=0,\"\",IF(NOT(ISNA(VLOOKUP(B3,Answers!$A$2:$B$15,2,FALSE))),VLOOKUP(B3,Answers!$A$2:$B$15,2,FALSE),\"Help!\"))","v":"Help!"},{"$f":"IF(C3=\"\",\"\",C3*B$2)","v":{"$error":"#VALUE!"}},"Phi",{"$f":"IF(E3=0,\"\",IF(NOT(ISNA(VLOOKUP(E3,Answers!#REF!,2,FALSE))),VLOOKUP(E3,Answers!#REF!,2,FALSE),\"Help!\"))","v":{"$error":"#REF!"}},{"$f":"IF(F3=\"\",\"\",F3*E$2)","v":{"$error":"#REF!"}},{"$f":"IF(G3=\"\",\"\",D3+G3)","v":{"$error":"#REF!"}},"zeta",{"$f":"IF(I3=0,\"\",IF(NOT(ISNA(VLOOKUP(I3,Answers!#REF!,2,FALSE))),VLOOKUP(I3,Answers!#REF!,2,FALSE),\"Help!\"))","v":{"$error":"#REF!"}},{"$f":"IF(J3=\"\",\"\",J3*I$2)","v":{"$error":"#REF!"}},{"$f":"IF(K3=\"\",\"\",H3+K3)","v":{"$error":"#REF!"}},"The Comedy of Errors",{"$f":"IF(M3=0,\"\",IF(NOT(ISNA(VLOOKUP(M3,Answers!#REF!,2,FALSE))),VLOOKUP(M3,Answers!#REF!,2,FALSE),\"Help!\"))","v":{"$error":"#REF!"}},{"$f":"IF(N3=\"\",\"\",N3*M$2)","v":{"$error":"#REF!"}},{"$f":"IF(O3=\"\",\"\",L3+O3)","v":{"$error":"#REF!"}},"Coriolanus",{"$f":"IF(Q3=0,\"\",IF(NOT(ISNA(VLOOKUP(Q3,Answers!#REF!,2,FALSE))),VLOOKUP(Q3,Answers!#REF!,2,FALSE),\"Help!\"))","v":{"$error":"#REF!"}},{"$f":"IF(R3=\"\",\"\",R3*Q$2)","v":{"$error":"#REF!"}},{"$f":"IF(S3=\"\",\"\",P3+S3)","v":{"$error":"#REF!"}},"King John",{"$f":"IF(U3=0,\"\",IF(NOT(ISNA(VLOOKUP(U3,Answers!#REF!,2,FALSE))),VLOOKUP(U3,Answers!#REF!,2,FALSE),\"Help!\"))","v":{"$error":"#REF!"}},{"$f":"IF(V3=\"\",\"\",V3*U$2)","v":{"$error":"#REF!"}},{"$f":"IF(W3=\"\",\"\",T3+W3)","v":{"$error":"#REF!"}},"No Country for Old Men",{"$f":"IF(Y3=0,\"\",IF(NOT(ISNA(VLOOKUP(Y3,Answers!#REF!,3,FALSE))),VLOOKUP(Y3,Answers!#REF!,3,FALSE),\"Help!\"))","v":{"$error":"#REF!"}},{"$f":"IF(Z3=\"\",\"\",Z3*Y$2)","v":{"$error":"#REF!"}},{"$f":"IF(AA3=\"\",\"\",X3+AA3)","v":{"$error":"#REF!"}},"How Green Was My Valley",{"$f":"IF(AC3=0,\"\",IF(NOT(ISNA(VLOOKUP(AC3,Answers!#REF!,3,FALSE))),VLOOKUP(AC3,Answers!#REF!,3,FALSE),\"Help!\"))","v":{"$error":"#REF!"}},{"$f":"IF(AD3=\"\",\"\",AD3*AC$2)","v":{"$error":"#REF!"}},{"$f":"IF(AE3=\"\",\"\",AB3+AE3)","v":{"$error":"#REF!"}},"Around the World In 80 Days",{"$f":"IF(AG3=0,\"\",IF(NOT(ISNA(VLOOKUP(AG3,Answers!#REF!,3,FALSE))),VLOOKUP(AG3,Answers!#REF!,3,FALSE),\"Help!\"))","v":{"$error":"#REF!"}},{"$f":"IF(AH3=\"\",\"\",AH3*AG$2)","v":{"$error":"#REF!"}},{"$f":"IF(AI3=\"\",\"\",AF3+AI3)","v":{"$error":"#REF!"}},"In The Heat of the Night",{"$f":"IF(AK3=0,\"\",IF(NOT(ISNA(VLOOKUP(AK3,Answers!#REF!,3,FALSE))),VLOOKUP(AK3,Answers!#REF!,3,FALSE),\"Help!\"))","v":{"$error":"#REF!"}},{"$f":"IF(AL3=\"\",\"\",AL3*AK$2)","v":{"$error":"#REF!"}},{"$f":"IF(AM3=\"\",\"\",AJ3+AM3)","v":{"$error":"#REF!"}},"South Africa",{"$f":"IF(AO3=0,\"\",IF(NOT(ISNA(VLOOKUP(AO3,Answers!#REF!,2,FALSE))),VLOOKUP(AO3,Answers!#REF!,2,FALSE),\"Help!\"))","v":{"$error":"#REF!"}},{"$f":"IF(AP3=\"\",\"\",AP3*AO$2)","v":{"$error":"#REF!"}},{"$f":"IF(AQ3=\"\",\"\",AN3+AQ3)","v":{"$error":"#REF!"}},"Malawi",{"$f":"IF(AS3=0,\"\",IF(NOT(ISNA(VLOOKUP(AS3,Answers!#REF!,2,FALSE))),VLOOKUP(AS3,Answers!#REF!,2,FALSE),\"Help!\"))","v":{"$error":"#REF!"}},{"$f":"IF(AT3=\"\",\"\",AT3*AS$2)","v":{"$error":"#REF!"}},{"$f":"IF(AU3=\"\",\"\",AR3+AU3)","v":{"$error":"#REF!"}},"Central African Republic",{"$f":"IF(AW3=0,\"\",IF(NOT(ISNA(VLOOKUP(AW3,Answers!#REF!,2,FALSE))),VLOOKUP(AW3,Answers!#REF!,2,FALSE),\"Help!\"))","v":{"$error":"#REF!"}},{"$f":"IF(AX3=\"\",\"\",AX3*AW$2)","v":{"$error":"#REF!"}},{"$f":"IF(AY3=\"\",\"\",AV3+AY3)","v":{"$error":"#REF!"}},"Eritrea",{"$f":"IF(BA3=0,\"\",IF(NOT(ISNA(VLOOKUP(BA3,Answers!#REF!,2,FALSE))),VLOOKUP(BA3,Answers!#REF!,2,FALSE),\"Help!\"))","v":{"$error":"#REF!"}},{"$f":"IF(BB3=\"\",\"\",BB3*BA$2)","v":{"$error":"#REF!"}},{"$f":"IF(BC3=\"\",\"\",AZ3+BC3)","v":{"$error":"#REF!"}},"Mauritania",{"$f":"IF(BE3=0,\"\",IF(NOT(ISNA(VLOOKUP(BE3,Answers!#REF!,2,FALSE))),VLOOKUP(BE3,Answers!#REF!,2,FALSE),\"Help!\"))","v":{"$error":"#REF!"}},{"$f":"IF(BF3=\"\",\"\",BF3*BE$2)","v":{"$error":"#REF!"}},{"$f":"IF(BG3=\"\",\"\",BD3+BG3)","v":{"$error":"#REF!"}},1,null,{"$f":"IF(INDEX($A:$BH,ROW(),1)=0,\"\",IF(INDEX($A:$BH,ROW(),4*$BL$1)=INDEX($A:$BH,ROW()-1,4*$BL$1),BK2,ROW()-2))","v":{"$error":"#REF!"}},{"$f":"IF(A3=0,\"\",CONCATENATE(BK3, \". \", INDEX($A:$BH,ROW(),1), \" — \", INDEX($A:$BH,ROW(),4*$BL$1-4), \" + \", INDEX($A:$BH,ROW(),4*$BL$1-1), \" = [b]\", INDEX($A:$BH,ROW(),4*$BL$1), \"[/b] pts (\", BK3-BI3, \")\"))","v":{"$error":"#REF!"}}]
["Rackme32","George H. W. Bush",{"$f":"IF(B4=0,\"\",IF(NOT(ISNA(VLOOKUP(B4,Answers!$A$2:$B$15,2,FALSE))),VLOOKUP(B4,Answers!$A$2:$B$15,2,FALSE),\"Help!\"))","v":"Help!"},{"$error":"#VALUE!"},"Beta",{"$f":"IF(E4=0,\"\",IF(NOT(ISNA(VLOOKUP(E4,Answers!#REF!,2,FALSE))),VLOOKUP(E4,Answers!#REF!,2,FALSE),\"Help!\"))","v":{"$error":"#REF!"}},{"$error":"#REF!"},{"$error":"#REF!"},"Omega",{"$f":"IF(I4=0,\"\",IF(NOT(ISNA(VLOOKUP(I4,Answers!#REF!,2,FALSE))),VLOOKUP(I4,Answers!#REF!,2,FALSE),\"Help!\"))","v":{"$error":"#REF!"}},{"$error":"#REF!"},{"$error":"#REF!"},"Henry V",{"$f":"IF(M4=0,\"\",IF(NOT(ISNA(VLOOKUP(M4,Answers!#REF!,2,FALSE))),VLOOKUP(M4,Answers!#REF!,2,FALSE),\"Help!\"))","v":{"$error":"#REF!"}},{"$error":"#REF!"},{"$error":"#REF!"},"Hamlet",{"$f":"IF(Q4=0,\"\",IF(NOT(ISNA(VLOOKUP(Q4,Answers!#REF!,2,FALSE))),VLOOKUP(Q4,Answers!#REF!,2,FALSE),\"Help!\"))","v":{"$error":"#REF!"}},{"$error":"#REF!"},{"$error":"#REF!"},"Troilus and Cressida",{"$f":"IF(U4=0,\"\",IF(NOT(ISNA(VLOOKUP(U4,Answers!#REF!,2,FALSE))),VLOOKUP(U4,Answers!#REF!,2,FALSE),\"Help!\"))","v":{"$error":"#REF!"}},{"$error":"#REF!"},{"$error":"#REF!"},"It Happened One Night",{"$f":"IF(Y4=0,\"\",IF(NOT(ISNA(VLOOKUP(Y4,Answers!#REF!,3,FALSE))),VLOOKUP(Y4,Answers!#REF!,3,FALSE),\"Help!\"))","v":{"$error":"#REF!"}},{"$error":"#REF!"},{"$error":"#REF!"},"Terms Of Endearment",{"$f":"IF(AC4=0,\"\",IF(NOT(ISNA(VLOOKUP(AC4,Answers!#REF!,3,FALSE))),VLOOKUP(AC4,Answers!#REF!,3,FALSE),\"Help!\"))","v":{"$error":"#REF!"}},{"$error":"#REF!"},{"$error":"#REF!"},"Driving Miss Daisy",{"$f":"IF(AG4=0,\"\",IF(NOT(ISNA(VLOOKUP(AG4,Answers!#REF!,3,FALSE))),VLOOKUP(AG4,Answers!#REF!,3,FALSE),\"Help!\"))","v":{"$error":"#REF!"}},{"$error":"#REF!"},{"$error":"#REF!"},"Going My Way",{"$f":"IF(AK4=0,\"\",IF(NOT(ISNA(VLOOKUP(AK4,Answers!#REF!,3,FALSE))),VLOOKUP(AK4,Answers!#REF!,3,FALSE),\"Help!\"))","v":{"$error":"#REF!"}},{"$error":"#REF!"},{"$error":"#REF!"},"Egypt",{"$f":"IF(AO4=0,\"\",IF(NOT(ISNA(VLOOKUP(AO4,Answers!#REF!,2,FALSE))),VLOOKUP(AO4,Answers!#REF!,2,FALSE),\"Help!\"))","v":{"$error":"#REF!"}},{"$error":"#REF!"},{"$error":"#REF!"},"Tunisia",{"$f":"IF(AS4=0,\"\",IF(NOT(ISNA(VLOOKUP(AS4,Answers!#REF!,2,FALSE))),VLOOKUP(AS4,Answers!#REF!,2,FALSE),\"Help!\"))","v":{"$error":"#REF!"}},{"$error":"#REF!"},{"$error":"#REF!"},"South Africa",{"$f":"IF(AW4=0,\"\",IF(NOT(ISNA(VLOOKUP(AW4,Answers!#REF!,2,FALSE))),VLOOKUP(AW4,Answers!#REF!,2,FALSE),\"Help!\"))","v":{"$error":"#REF!"}},{"$error":"#REF!"},{"$error":"#REF!"},"Tanzania",{"$f":"IF(BA4=0,\"\",IF(NOT(ISNA(VLOOKUP(BA4,Answers!#REF!,2,FALSE))),VLOOKUP(BA4,Answers!#REF!,2,FALSE),\"Help!\"))","v":{"$error":"#REF!"}},{"$error":"#REF!"},{"$error":"#REF!"},"Sierra Leone",{"$f":"IF(BE4=0,\"\",IF(NOT(ISNA(VLOOKUP(BE4,Answers!#REF!,2,FALSE))),VLOOKUP(BE4,Answers!#REF!,2,FALSE),\"Help!\"))","v":{"$error":"#REF!"}},{"$error":"#REF!"},{"$error":"#REF!"},2,null,{"$error":"#REF!"},{"$f":"IF(A4=0,\"\",CONCATENATE(BK4, \". \", INDEX($A:$BH,ROW(),1), \" — \", INDEX($A:$BH,ROW(),4*$BL$1-4), \" + \", INDEX($A:$BH,ROW(),4*$BL$1-1), \" = [b]\", INDEX($A:$BH,ROW(),4*$BL$1), \"[/b] pts (\", BK4-BI4, \")\"))","v":{"$error":"#REF!"}}]
["econgator","Richard Nixon",{"$f":"IF(B5=0,\"\",IF(NOT(ISNA(VLOOKUP(B5,Answers!$A$2:$B$15,2,FALSE))),VLOOKUP(B5,Answers!$A$2:$B$15,2,FALSE),\"Help!\"))","v":"Help!"},{"$error":"#VALUE!"},"Chi",{"$f":"IF(E5=0,\"\",IF(NOT(ISNA(VLOOKUP(E5,Answers!#REF!,2,FALSE))),VLOOKUP(E5,Answers!#REF!,2,FALSE),\"Help!\"))","v":{"$error":"#REF!"}},{"$error":"#REF!"},{"$error":"#REF!"},"Xi",{"$f":"IF(I5=0,\"\",IF(NOT(ISNA(VLOOKUP(I5,Answers!#REF!,2,FALSE))),VLOOKUP(I5,Answers!#REF!,2,FALSE),\"Help!\"))","v":{"$error":"#REF!"}},{"$error":"#REF!"},{"$error":"#REF!"},"Twelfth Night",{"$f":"IF(M5=0,\"\",IF(NOT(ISNA(VLOOKUP(M5,Answers!#REF!,2,FALSE))),VLOOKUP(M5,Answers!#REF!,2,FALSE),\"Help!\"))","v":{"$error":"#REF!"}},{"$error":"#REF!"},{"$error":"#REF!"},"A Midsummer Night's Dream",{"$f":"IF(Q5=0,\"\",IF(NOT(ISNA(VLOOKUP(Q5,Answers!#REF!,2,FALSE))),VLOOKUP(Q5,Answers!#REF!,2,FALSE),\"Help!\"))","v":{"$error":"#REF!"}},{"$error":"#REF!"},{"$error":"#REF!"},"Timon of Athens",{"$f":"IF(U5=0,\"\",IF(NOT(ISNA(VLOOKUP(U5,Answers!#REF!,2,FALSE))),VLOOKUP(U5,Answers!#REF!,2,FALSE),\"Help!\"))","v":{"$error":"#REF!"}},{"$error":"#REF!"},{"$error":"#REF!"},"Gone with the Wind",{"$f":"IF(Y5=0,\"\",IF(NOT(ISNA(VLOOKUP(Y5,Answers!#REF!,3,FALSE))),VLOOKUP(Y5,Answers!#REF!,3,FALSE),\"Help!\"))","v":{"$error":"#REF!"}},{"$error":"#REF!"},{"$error":"#REF!"},"The Silence of the Lambs",{"$f":"IF(AC5=0,\"\",IF(NOT(ISNA(VLOOKUP(AC5,Answers!#REF!,3,FALSE))),VLOOKUP(AC5,Answers!#REF!,3,FALSE),\"Help!\"))","v":{"$error":"#REF!"}},{"$error":"#REF!"},{"$error":"#REF!"},"Kramer vs. Kramer",{"$f":"IF(AG5=0,\"\",IF(NOT(ISNA(VLOOKUP(AG5,Answers!#REF!,3,FALSE))),VLOOKUP(AG5,Answers!#REF!,3,FALSE),\"Help!\"))","v":{"$error":"#REF!"}},{"$error":"#REF!"},{"$error":"#REF!"},"The Bridge on the River Kwai",{"$f":"IF(AK5=0,\"\",IF(NOT(ISNA(VLOOKUP(AK5,Answers!#REF!,3,FALSE))),VLOOKUP(AK5,Answers!#REF!,3,FALSE),\"Help!\"))","v":{"$error":"#REF!"}},{"$error":"#REF!"},{"$error":"#REF!"},"Egypt",{"$f":"IF(AO5=0,\"\",IF(NOT(ISNA(VLOOKUP(AO5,Answers!#REF!,2,FALSE))),VLOOKUP(AO5,Answers!#REF!,2,FALSE),\"Help!\"))","v":{"$error":"#REF!"}},{"$error":"#REF!"},{"$error":"#REF!"},"South Africa",{"$f":"IF(AS5=0,\"\",IF(NOT(ISNA(VLOOKUP(AS5,Answers!#REF!,2,FALSE))),VLOOKUP(AS5,Answers!#REF!,2,FALSE),\"Help!\"))","v":{"$error":"#REF!"}},{"$error":"#REF!"},{"$error":"#REF!"},"Zambia",{"$f":"IF(AW5=0,\"\",IF(NOT(ISNA(VLOOKUP(AW5,Answers!#REF!,2,FALSE))),VLOOKUP(AW5,Answers!#REF!,2,FALSE),\"Help!\"))","v":{"$error":"#REF!"}},{"$error":"#REF!"},{"$error":"#REF!"},"Democratic Republic of the Congo",{"$f":"IF(BA5=0,\"\",IF(NOT(ISNA(VLOOKUP(BA5,Answers!#REF!,2,FALSE))),VLOOKUP(BA5,Answers!#REF!,2,FALSE),\"Help!\"))","v":{"$error":"#REF!"}},{"$error":"#REF!"},{"$error":"#REF!"},"Ethiopia",{"$f":"IF(BE5=0,\"\",IF(NOT(ISNA(VLOOKUP(BE5,Answers!#REF!,2,FALSE))),VLOOKUP(BE5,Answers!#REF!,2,FALSE),\"Help!\"))","v":{"$error":"#REF!"}},{"$error":"#REF!"},{"$error":"#REF!"},3,null,{"$error":"#REF!"},{"$error":"#REF!"}]
["mennoknight","Richard Nixon",{"$f":"IF(B6=0,\"\",IF(NOT(ISNA(VLOOKUP(B6,Answers!$A$2:$B$15,2,FALSE))),VLOOKUP(B6,Answers!$A$2:$B$15,2,FALSE),\"Help!\"))","v":"Help!"},{"$error":"#VALUE!"},"Lambda",{"$f":"IF(E6=0,\"\",IF(NOT(ISNA(VLOOKUP(E6,Answers!#REF!,2,FALSE))),VLOOKUP(E6,Answers!#REF!,2,FALSE),\"Help!\"))","v":{"$error":"#REF!"}},{"$error":"#REF!"},{"$error":"#REF!"},"Epsilon",{"$f":"IF(I6=0,\"\",IF(NOT(ISNA(VLOOKUP(I6,Answers!#REF!,2,FALSE))),VLOOKUP(I6,Answers!#REF!,2,FALSE),\"Help!\"))","v":{"$error":"#REF!"}},{"$error":"#REF!"},{"$error":"#REF!"},"King Lear",{"$f":"IF(M6=0,\"\",IF(NOT(ISNA(VLOOKUP(M6,Answers!#REF!,2,FALSE))),VLOOKUP(M6,Answers!#REF!,2,FALSE),\"Help!\"))","v":{"$error":"#REF!"}},{"$error":"#REF!"},{"$error":"#REF!"},"Richard III",{"$f":"IF(Q6=0,\"\",IF(NOT(ISNA(VLOOKUP(Q6,Answers!#REF!,2,FALSE))),VLOOKUP(Q6,Answers!#REF!,2,FALSE),\"Help!\"))","v":{"$error":"#REF!"}},{"$error":"#REF!"},{"$error":"#REF!"},"Romeo and Juliet",{"$f":"IF(U6=0,\"\",IF(NOT(ISNA(VLOOKUP(U6,Answers!#REF!,2,FALSE))),VLOOKUP(U6,Answers!#REF!,2,FALSE),\"Help!\"))","v":{"$error":"#REF!"}},{"$error":"#REF!"},{"$error":"#REF!"},"One Flew Over the Cuckoo's Nest",{"$f":"IF(Y6=0,\"\",IF(NOT(ISNA(VLOOKUP(Y6,Answers!#REF!,3,FALSE))),VLOOKUP(Y6,Answers!#REF!,3,FALSE),\"Help!\"))","v":{"$error":"#REF!"}},{"$error":"#REF!"},{"$error":"#REF!"},"No Country for Old Men",{"$f":"IF(AC6=0,\"\",IF(NOT(ISNA(VLOOKUP(AC6,Answers!#REF!,3,FALSE))),VLOOKUP(AC6,Answers!#REF!,3,FALSE),\"Help!\"))","v":{"$error":"#REF!"}},{"$error":"#REF!"},{"$error":"#REF!"},"The King's Speech",{"$f":"IF(AG6=0,\"\",IF(NOT(ISNA(VLOOKUP(AG6,Answers!#REF!,3,FALSE))),VLOOKUP(AG6,Answers!#REF!,3,FALSE),\"Help!\"))","v":{"$error":"#REF!"}},{"$error":"#REF!"},{"$error":"#REF!"},"Terms of Endearment",{"$f":"IF(AK6=0,\"\",IF(NOT(ISNA(VLOOKUP(AK6,Answers!#REF!,3,FALSE))),VLOOKUP(AK6,Answers!#REF!,3,FALSE),\"Help!\"))","v":{"$error":"#REF!"}},{"$error":"#REF!"},{"$error":"#REF!"},"Egypt",{"$f":"IF(AO6=0,\"\",IF(NOT(ISNA(VLOOKUP(AO6,Answers!#REF!,2,FALSE))),VLOOKUP(AO6,Answers!#REF!,2,FALSE),\"Help!\"))","v":{"$error":"#REF!"}},{"$error":"#REF!"},{"$error":"#REF!"},"Lesotho",{"$f":"IF(AS6=0,\"\",IF(NOT(ISNA(VLOOKUP(AS6,Answers!#REF!,2,FALSE))),VLOOKUP(AS6,Answers!#REF!,2,FALSE),\"Help!\"))","v":{"$error":"#REF!"}},{"$error":"#REF!"},{"$error":"#REF!"},"Ghana",{"$f":"IF(AW6=0,\"\",IF(NOT(ISNA(VLOOKUP(AW6,Answers!#REF!,2,FALSE))),VLOOKUP(AW6,Answers!#REF!,2,FALSE),\"Help!\"))","v":{"$error":"#REF!"}},{"$error":"#REF!"},{"$error":"#REF!"},"Gambia",{"$f":"IF(BA6=0,\"\",IF(NOT(ISNA(VLOOKUP(BA6,Answers!#REF!,2,FALSE))),VLOOKUP(BA6,Answers!#REF!,2,FALSE),\"Help!\"))","v":{"$error":"#REF!"}},{"$error":"#REF!"},{"$error":"#REF!"},"Guinea-Bissau",{"$f":"IF(BE6=0,\"\",IF(NOT(ISNA(VLOOKUP(BE6,Answers!#REF!,2,FALSE))),VLOOKUP(BE6,Answers!#REF!,2,FALSE),\"Help!\"))","v":{"$error":"#REF!"}},{"$error":"#REF!"},{"$error":"#REF!"},{"$error":"#REF!"},null,{"$error":"#REF!"},{"$error":"#REF!"}]
["nightreign","John Tyler",{"$f":"IF(B7=0,\"\",IF(NOT(ISNA(VLOOKUP(B7,Answers!$A$2:$B$15,2,FALSE))),VLOOKUP(B7,Answers!$A$2:$B$15,2,FALSE),\"Help!\"))","v":"Help!"},{"$error":"#VALUE!"},"Pi",{"$f":"IF(E7=0,\"\",IF(NOT(ISNA(VLOOKUP(E7,Answers!#REF!,2,FALSE))),VLOOKUP(E7,Answers!#REF!,2,FALSE),\"Help!\"))","v":{"$error":"#REF!"}},{"$error":"#REF!"},{"$error":"#REF!"},"Alpha",{"$f":"IF(I7=0,\"\",IF(NOT(ISNA(VLOOKUP(I7,Answers!#REF!,2,FALSE))),VLOOKUP(I7,Answers!#REF!,2,FALSE),\"Help!\"))","v":{"$error":"#REF!"}},{"$error":"#REF!"},{"$error":"#REF!"},"The Tempest",{"$f":"IF(M7=0,\"\",IF(NOT(ISNA(VLOOKUP(M7,Answers!#REF!,2,FALSE))),VLOOKUP(M7,Answers!#REF!,2,FALSE),\"Help!\"))","v":{"$error":"#REF!"}},{"$error":"#REF!"},{"$error":"#REF!"},"Hamlet",{"$f":"IF(Q7=0,\"\",IF(NOT(ISNA(VLOOKUP(Q7,Answers!#REF!,2,FALSE))),VLOOKUP(Q7,Answers!#REF!,2,FALSE),\"Help!\"))","v":{"$error":"#REF!"}},{"$error":"#REF!"},{"$error":"#REF!"},"The Merchant of Venice",{"$f":"IF(U7=0,\"\",IF(NOT(ISNA(VLOOKUP(U7,Answers!#REF!,2,FALSE))),VLOOKUP(U7,Answers!#REF!,2,FALSE),\"Help!\"))","v":{"$error":"#REF!"}},{"$error":"#REF!"},{"$error":"#REF!"},"The Silence of the Lambs",{"$f":"IF(Y7=0,\"\",IF(NOT(ISNA(VLOOKUP(Y7,Answers!#REF!,3,FALSE))),VLOOKUP(Y7,Answers!#REF!,3,FALSE),\"Help!\"))","v":{"$error":"#REF!"}},{"$error":"#REF!"},{"$error":"#REF!"},"As Good As It Gets",{"$f":"Mainframe!$S$1","v":"Question 17"},{"$error":"#VALUE!"},{"$error":"#VALUE!"},"The Hurt Locker",{"$f":"IF(AG7=0,\"\",IF(NOT(ISNA(VLOOKUP(AG7,Answers!#REF!,3,FALSE))),VLOOKUP(AG7,Answers!#REF!,3,FALSE),\"Help!\"))","v":{"$error":"#REF!"}},{"$error":"#REF!"},{"$error":"#REF!"},"12 Years a Slave",{"$f":"IF(AK7=0,\"\",IF(NOT(ISNA(VLOOKUP(AK7,Answers!#REF!,3,FALSE))),VLOOKUP(AK7,Answers!#REF!,3,FALSE),\"Help!\"))","v":{"$error":"#REF!"}},{"$error":"#REF!"},{"$error":"#REF!"},"South Africa",{"$f":"IF(AO7=0,\"\",IF(NOT(ISNA(VLOOKUP(AO7,Answers!#REF!,2,FALSE))),VLOOKUP(AO7,Answers!#REF!,2,FALSE),\"Help!\"))","v":{"$error":"#REF!"}},{"$error":"#REF!"},{"$error":"#REF!"},"Democratic Republic of the Congo",{"$f":"IF(AS7=0,\"\",IF(NOT(ISNA(VLOOKUP(AS7,Answers!#REF!,2,FALSE))),VLOOKUP(AS7,Answers!#REF!,2,FALSE),\"Help!\"))","v":{"$error":"#REF!"}},{"$error":"#REF!"},{"$error":"#REF!"},"Lesotho",{"$f":"IF(AW7=0,\"\",IF(NOT(ISNA(VLOOKUP(AW7,Answers!#REF!,2,FALSE))),VLOOKUP(AW7,Answers!#REF!,2,FALSE),\"Help!\"))","v":{"$error":"#REF!"}},{"$error":"#REF!"},{"$error":"#REF!"},"Mali",{"$f":"IF(BA7=0,\"\",IF(NOT(ISNA(VLOOKUP(BA7,Answers!#REF!,2,FALSE))),VLOOKUP(BA7,Answers!#REF!,2,FALSE),\"Help!\"))","v":{"$error":"#REF!"}},{"$error":"#REF!"},{"$error":"#REF!"},"Swaziland",{"$f":"IF(BE7=0,\"\",IF(NOT(ISNA(VLOOKUP(BE7,Answers!#REF!,2,FALSE))),VLOOKUP(BE7,Answers!#REF!,2,FALSE),\"Help!\"))","v":{"$error":"#REF!"}},{"$error":"#REF!"},{"$error":"#REF!"},5,null,{"$error":"#REF!"},{"$error":"#REF!"}]
["hscer","Chester A. Arthur",{"$f":"IF(B8=0,\"\",IF(NOT(ISNA(VLOOKUP(B8,Answers!$A$2:$B$15,2,FALSE))),VLOOKUP(B8,Answers!$A$2:$B$15,2,FALSE),\"Help!\"))","v":"Help!"},{"$error":"#VALUE!"},"gamma",{"$f":"IF(E8=0,\"\",IF(NOT(ISNA(VLOOKUP(E8,Answers!#REF!,2,FALSE))),VLOOKUP(E8,Answers!#REF!,2,FALSE),\"Help!\"))","v":{"$error":"#REF!"}},{"$error":"#REF!"},{"$error":"#REF!"},"omicron",{"$f":"IF(I8=0,\"\",IF(NOT(ISNA(VLOOKUP(I8,Answers!#REF!,2,FALSE))),VLOOKUP(I8,Answers!#REF!,2,FALSE),\"Help!\"))","v":{"$error":"#REF!"}},{"$error":"#REF!"},{"$error":"#REF!"},"The Two Gentlemen of Verona",{"$f":"IF(M8=0,\"\",IF(NOT(ISNA(VLOOKUP(M8,Answers!#REF!,2,FALSE))),VLOOKUP(M8,Answers!#REF!,2,FALSE),\"Help!\"))","v":{"$error":"#REF!"}},{"$error":"#REF!"},{"$error":"#REF!"},"Titus Andronicus",{"$f":"IF(Q8=0,\"\",IF(NOT(ISNA(VLOOKUP(Q8,Answers!#REF!,2,FALSE))),VLOOKUP(Q8,Answers!#REF!,2,FALSE),\"Help!\"))","v":{"$error":"#REF!"}},{"$error":"#REF!"},{"$error":"#REF!"},"All's Well That Ends Well",{"$f":"IF(U8=0,\"\",IF(NOT(ISNA(VLOOKUP(U8,Answers!#REF!,2,FALSE))),VLOOKUP(U8,Answers!#REF!,2,FALSE),\"Help!\"))","v":{"$error":"#REF!"}},{"$error":"#REF!"},{"$error":"#REF!"},"Gone with the Wind",{"$f":"IF(Y8=0,\"\",IF(NOT(ISNA(VLOOKUP(Y8,Answers!#REF!,3,FALSE))),VLOOKUP(Y8,Answers!#REF!,3,FALSE),\"Help!\"))","v":{"$error":"#REF!"}},{"$error":"#REF!"},{"$error":"#REF!"},"All Quiet on the Western Front",{"$f":"IF(AC8=0,\"\",IF(NOT(ISNA(VLOOKUP(AC8,Answers!#REF!,3,FALSE))),VLOOKUP(AC8,Answers!#REF!,3,FALSE),\"Help!\"))","v":{"$error":"#REF!"}},{"$error":"#REF!"},{"$error":"#REF!"},"The Lord of the Rings: The Return of the King",{"$f":"IF(AG8=0,\"\",IF(NOT(ISNA(VLOOKUP(AG8,Answers!#REF!,3,FALSE))),VLOOKUP(AG8,Answers!#REF!,3,FALSE),\"Help!\"))","v":{"$error":"#REF!"}},{"$error":"#REF!"},{"$error":"#REF!"},"The Greatest Show on Earth",{"$f":"IF(AK8=0,\"\",IF(NOT(ISNA(VLOOKUP(AK8,Answers!#REF!,3,FALSE))),VLOOKUP(AK8,Answers!#REF!,3,FALSE),\"Help!\"))","v":{"$error":"#REF!"}},{"$error":"#REF!"},{"$error":"#REF!"},"South Africa",{"$f":"IF(AO8=0,\"\",IF(NOT(ISNA(VLOOKUP(AO8,Answers!#REF!,2,FALSE))),VLOOKUP(AO8,Answers!#REF!,2,FALSE),\"Help!\"))","v":{"$error":"#REF!"}},{"$error":"#REF!"},{"$error":"#REF!"},"South Sudan",{"$f":"IF(AS8=0,\"\",IF(NOT(ISNA(VLOOKUP(AS8,Answers!#REF!,2,FALSE))),VLOOKUP(AS8,Answers!#REF!,2,FALSE),\"Help!\"))","v":{"$error":"#REF!"}},{"$error":"#REF!"},{"$error":"#REF!"},"Sierra Leone",{"$f":"IF(AW8=0,\"\",IF(NOT(ISNA(VLOOKUP(AW8,Answers!#REF!,2,FALSE))),VLOOKUP(AW8,Answers!#REF!,2,FALSE),\"Help!\"))","v":{"$error":"#REF!"}},{"$error":"#REF!"},{"$error":"#REF!"},"Senegal",{"$f":"IF(BA8=0,\"\",IF(NOT(ISNA(VLOOKUP(BA8,Answers!#REF!,2,FALSE))),VLOOKUP(BA8,Answers!#REF!,2,FALSE),\"Help!\"))","v":{"$error":"#REF!"}},{"$error":"#REF!"},{"$error":"#REF!"},"Seychelles",{"$f":"IF(BE8=0,\"\",IF(NOT(ISNA(VLOOKUP(BE8,Answers!#REF!,2,FALSE))),VLOOKUP(BE8,Answers!#REF!,2,FALSE),\"Help!\"))","v":{"$error":"#REF!"}},{"$error":"#REF!"},{"$error":"#REF!"},6,null,{"$error":"#REF!"},{"$error":"#REF!"}]
["Paucle","Chester A. Arthur",{"$f":"IF(B9=0,\"\",IF(NOT(ISNA(VLOOKUP(B9,Answers!$A$2:$B$15,2,FALSE))),VLOOKUP(B9,Answers!$A$2:$B$15,2,FALSE),\"Help!\"))","v":"Help!"},{"$error":"#VALUE!"},"upsilon",{"$f":"IF(E9=0,\"\",IF(NOT(ISNA(VLOOKUP(E9,Answers!#REF!,2,FALSE))),VLOOKUP(E9,Answers!#REF!,2,FALSE),\"Help!\"))","v":{"$error":"#REF!"}},{"$error":"#REF!"},{"$error":"#REF!"},"epsilon",{"$f":"IF(I9=0,\"\",IF(NOT(ISNA(VLOOKUP(I9,Answers!#REF!,2,FALSE))),VLOOKUP(I9,Answers!#REF!,2,FALSE),\"Help!\"))","v":{"$error":"#REF!"}},{"$error":"#REF!"},{"$error":"#REF!"},"troilus and cressida",{"$f":"IF(M9=0,\"\",IF(NOT(ISNA(VLOOKUP(M9,Answers!#REF!,2,FALSE))),VLOOKUP(M9,Answers!#REF!,2,FALSE),\"Help!\"))","v":{"$error":"#REF!"}},{"$error":"#REF!"},{"$error":"#REF!"},"coriolanus",{"$f":"IF(Q9=0,\"\",IF(NOT(ISNA(VLOOKUP(Q9,Answers!#REF!,2,FALSE))),VLOOKUP(Q9,Answers!#REF!,2,FALSE),\"Help!\"))","v":{"$error":"#REF!"}},{"$error":"#REF!"},{"$error":"#REF!"},"HENRY VI, PART 2",{"$f":"IF(U9=0,\"\",IF(NOT(ISNA(VLOOKUP(U9,Answers!#REF!,2,FALSE))),VLOOKUP(U9,Answers!#REF!,2,FALSE),\"Help!\"))","v":{"$error":"#REF!"}},{"$error":"#REF!"},{"$error":"#REF!"},"all quiet on the western front",{"$f":"IF(Y9=0,\"\",IF(NOT(ISNA(VLOOKUP(Y9,Answers!#REF!,3,FALSE))),VLOOKUP(Y9,Answers!#REF!,3,FALSE),\"Help!\"))","v":{"$error":"#REF!"}},{"$error":"#REF!"},{"$error":"#REF!"},"the lost weekend",{"$f":"IF(AC9=0,\"\",IF(NOT(ISNA(VLOOKUP(AC9,Answers!#REF!,3,FALSE))),VLOOKUP(AC9,Answers!#REF!,3,FALSE),\"Help!\"))","v":{"$error":"#REF!"}},{"$error":"#REF!"},{"$error":"#REF!"},"an American in Paris",{"$f":"IF(AG9=0,\"\",IF(NOT(ISNA(VLOOKUP(AG9,Answers!#REF!,3,FALSE))),VLOOKUP(AG9,Answers!#REF!,3,FALSE),\"Help!\"))","v":{"$error":"#REF!"}},{"$error":"#REF!"},{"$error":"#REF!"},"all about eve",{"$f":"IF(AK9=0,\"\",IF(NOT(ISNA(VLOOKUP(AK9,Answers!#REF!,3,FALSE))),VLOOKUP(AK9,Answers!#REF!,3,FALSE),\"Help!\"))","v":{"$error":"#REF!"}},{"$error":"#REF!"},{"$error":"#REF!"},"egypt",{"$f":"IF(AO9=0,\"\",IF(NOT(ISNA(VLOOKUP(AO9,Answers!#REF!,2,FALSE))),VLOOKUP(AO9,Answers!#REF!,2,FALSE),\"Help!\"))","v":{"$error":"#REF!"}},{"$error":"#REF!"},{"$error":"#REF!"},"chad",{"$f":"IF(AS9=0,\"\",IF(NOT(ISNA(VLOOKUP(AS9,Answers!#REF!,2,FALSE))),VLOOKUP(AS9,Answers!#REF!,2,FALSE),\"Help!\"))","v":{"$error":"#REF!"}},{"$error":"#REF!"},{"$error":"#REF!"},"comoros",{"$f":"IF(AW9=0,\"\",IF(NOT(ISNA(VLOOKUP(AW9,Answers!#REF!,2,FALSE))),VLOOKUP(AW9,Answers!#REF!,2,FALSE),\"Help!\"))","v":{"$error":"#REF!"}},{"$error":"#REF!"},{"$error":"#REF!"},"benin",{"$f":"IF(BA9=0,\"\",IF(NOT(ISNA(VLOOKUP(BA9,Answers!#REF!,2,FALSE))),VLOOKUP(BA9,Answers!#REF!,2,FALSE),\"Help!\"))","v":{"$error":"#REF!"}},{"$error":"#REF!"},{"$error":"#REF!"},"Réunion",{"$f":"Mainframe!$S$1","v":"Question 17"},{"$error":"#VALUE!"},{"$error":"#VALUE!"},{"$error":"#REF!"},null,{"$error":"#REF!"},{"$error":"#REF!"}]
["Woof","Calvin Coolidge",{"$f":"IF(B10=0,\"\",IF(NOT(ISNA(VLOOKUP(B10,Answers!$A$2:$B$15,2,FALSE))),VLOOKUP(B10,Answers!$A$2:$B$15,2,FALSE),\"Help!\"))","v":"Help!"},{"$error":"#VALUE!"},"eta",{"$f":"IF(E10=0,\"\",IF(NOT(ISNA(VLOOKUP(E10,Answers!#REF!,2,FALSE))),VLOOKUP(E10,Answers!#REF!,2,FALSE),\"Help!\"))","v":{"$error":"#REF!"}},{"$error":"#REF!"},{"$error":"#REF!"},"upsilon",{"$f":"IF(I10=0,\"\",IF(NOT(ISNA(VLOOKUP(I10,Answers!#REF!,2,FALSE))),VLOOKUP(I10,Answers!#REF!,2,FALSE),\"Help!\"))","v":{"$error":"#REF!"}},{"$error":"#REF!"},{"$error":"#REF!"},"Measure for Measure",{"$f":"IF(M10=0,\"\",IF(NOT(ISNA(VLOOKUP(M10,Answers!#REF!,2,FALSE))),VLOOKUP(M10,Answers!#REF!,2,FALSE),\"Help!\"))","v":{"$error":"#REF!"}},{"$error":"#REF!"},{"$error":"#REF!"},"Henry VIII",{"$f":"IF(Q10=0,\"\",IF(NOT(ISNA(VLOOKUP(Q10,Answers!#REF!,2,FALSE))),VLOOKUP(Q10,Answers!#REF!,2,FALSE),\"Help!\"))","v":{"$error":"#REF!"}},{"$error":"#REF!"},{"$error":"#REF!"},"Julius Caesar",{"$f":"IF(U10=0,\"\",IF(NOT(ISNA(VLOOKUP(U10,Answers!#REF!,2,FALSE))),VLOOKUP(U10,Answers!#REF!,2,FALSE),\"Help!\"))","v":{"$error":"#REF!"}},{"$error":"#REF!"},{"$error":"#REF!"},"All Quiet on the Western Front",{"$f":"IF(Y10=0,\"\",IF(NOT(ISNA(VLOOKUP(Y10,Answers!#REF!,3,FALSE))),VLOOKUP(Y10,Answers!#REF!,3,FALSE),\"Help!\"))","v":{"$error":"#REF!"}},{"$error":"#REF!"},{"$error":"#REF!"},"The Lord of the Rings: The Return of the King",{"$f":"IF(AC10=0,\"\",IF(NOT(ISNA(VLOOKUP(AC10,Answers!#REF!,3,FALSE))),VLOOKUP(AC10,Answers!#REF!,3,FALSE),\"Help!\"))","v":{"$error":"#REF!"}},{"$error":"#REF!"},{"$error":"#REF!"},"How Green Was My Valley",{"$f":"IF(AG10=0,\"\",IF(NOT(ISNA(VLOOKUP(AG10,Answers!#REF!,3,FALSE))),VLOOKUP(AG10,Answers!#REF!,3,FALSE),\"Help!\"))","v":{"$error":"#REF!"}},{"$error":"#REF!"},{"$error":"#REF!"},"It Happened One Night",{"$f":"IF(AK10=0,\"\",IF(NOT(ISNA(VLOOKUP(AK10,Answers!#REF!,3,FALSE))),VLOOKUP(AK10,Answers!#REF!,3,FALSE),\"Help!\"))","v":{"$error":"#REF!"}},{"$error":"#REF!"},{"$error":"#REF!"},"SÃO TOMÉ AND PRÍNCIPE",{"$f":"IF(AO10=0,\"\",IF(NOT(ISNA(VLOOKUP(AO10,Answers!#REF!,2,FALSE))),VLOOKUP(AO10,Answers!#REF!,2,FALSE),\"Help!\"))","v":{"$error":"#REF!"}},{"$error":"#REF!"},{"$error":"#REF!"},"Benin",{"$f":"IF(AS10=0,\"\",IF(NOT(ISNA(VLOOKUP(AS10,Answers!#REF!,2,FALSE))),VLOOKUP(AS10,Answers!#REF!,2,FALSE),\"Help!\"))","v":{"$error":"#REF!"}},{"$error":"#REF!"},{"$error":"#REF!"},"Burundi",{"$f":"IF(AW10=0,\"\",IF(NOT(ISNA(VLOOKUP(AW10,Answers!#REF!,2,FALSE))),VLOOKUP(AW10,Answers!#REF!,2,FALSE),\"Help!\"))","v":{"$error":"#REF!"}},{"$error":"#REF!"},{"$error":"#REF!"},"Mozambique",{"$f":"IF(BA10=0,\"\",IF(NOT(ISNA(VLOOKUP(BA10,Answers!#REF!,2,FALSE))),VLOOKUP(BA10,Answers!#REF!,2,FALSE),\"Help!\"))","v":{"$error":"#REF!"}},{"$error":"#REF!"},{"$error":"#REF!"},"Togo",{"$f":"IF(BE10=0,\"\",IF(NOT(ISNA(VLOOKUP(BE10,Answers!#REF!,2,FALSE))),VLOOKUP(BE10,Answers!#REF!,2,FALSE),\"Help!\"))","v":{"$error":"#REF!"}},{"$error":"#REF!"},{"$error":"#REF!"},8,null,{"$error":"#REF!"},{"$error":"#REF!"}]
["ElendilPickle","John Adams",{"$f":"IF(B11=0,\"\",IF(NOT(ISNA(VLOOKUP(B11,Answers!$A$2:$B$15,2,FALSE))),VLOOKUP(B11,Answers!$A$2:$B$15,2,FALSE),\"Help!\"))","v":"Help!"},{"$error":"#VALUE!"},"eta",{"$f":"IF(E11=0,\"\",IF(NOT(ISNA(VLOOKUP(E11,Answers!#REF!,2,FALSE))),VLOOKUP(E11,Answers!#REF!,2,FALSE),\"Help!\"))","v":{"$error":"#REF!"}},{"$error":"#REF!"},{"$error":"#REF!"},"mu",{"$f":"IF(I11=0,\"\",IF(NOT(ISNA(VLOOKUP(I11,Answers!#REF!,2,FALSE))),VLOOKUP(I11,Answers!#REF!,2,FALSE),\"Help!\"))","v":{"$error":"#REF!"}},{"$error":"#REF!"},{"$error":"#REF!"},"Twelfth Night",{"$f":"IF(M11=0,\"\",IF(NOT(ISNA(VLOOKUP(M11,Answers!#REF!,2,FALSE))),VLOOKUP(M11,Answers!#REF!,2,FALSE),\"Help!\"))","v":{"$error":"#REF!"}},{"$error":"#REF!"},{"$error":"#REF!"},"Henry V",{"$f":"IF(Q11=0,\"\",IF(NOT(ISNA(VLOOKUP(Q11,Answers!#REF!,2,FALSE))),VLOOKUP(Q11,Answers!#REF!,2,FALSE),\"Help!\"))","v":{"$error":"#REF!"}},{"$error":"#REF!"},{"$error":"#REF!"},"Love's Labour's Lost",{"$f":"IF(U11=0,\"\",IF(NOT(ISNA(VLOOKUP(U11,Answers!#REF!,2,FALSE))),VLOOKUP(U11,Answers!#REF!,2,FALSE),\"Help!\"))","v":{"$error":"#REF!"}},{"$error":"#REF!"},{"$error":"#REF!"},"The Lord of the Rings: The Return of the King",{"$f":"IF(Y11=0,\"\",IF(NOT(ISNA(VLOOKUP(Y11,Answers!#REF!,3,FALSE))),VLOOKUP(Y11,Answers!#REF!,3,FALSE),\"Help!\"))","v":{"$error":"#REF!"}},{"$error":"#REF!"},{"$error":"#REF!"},"The Hurt Locker",{"$f":"IF(AC11=0,\"\",IF(NOT(ISNA(VLOOKUP(AC11,Answers!#REF!,3,FALSE))),VLOOKUP(AC11,Answers!#REF!,3,FALSE),\"Help!\"))","v":{"$error":"#REF!"}},{"$error":"#REF!"},{"$error":"#REF!"},"Gone With the Wind",{"$f":"IF(AG11=0,\"\",IF(NOT(ISNA(VLOOKUP(AG11,Answers!#REF!,3,FALSE))),VLOOKUP(AG11,Answers!#REF!,3,FALSE),\"Help!\"))","v":{"$error":"#REF!"}},{"$error":"#REF!"},{"$error":"#REF!"},"West Side Story",{"$f":"IF(AK11=0,\"\",IF(NOT(ISNA(VLOOKUP(AK11,Answers!#REF!,3,FALSE))),VLOOKUP(AK11,Answers!#REF!,3,FALSE),\"Help!\"))","v":{"$error":"#REF!"}},{"$error":"#REF!"},{"$error":"#REF!"},"Kenya",{"$f":"IF(AO11=0,\"\",IF(NOT(ISNA(VLOOKUP(AO11,Answers!#REF!,2,FALSE))),VLOOKUP(AO11,Answers!#REF!,2,FALSE),\"Help!\"))","v":{"$error":"#REF!"}},{"$error":"#REF!"},{"$error":"#REF!"},"Morocco",{"$f":"IF(AS11=0,\"\",IF(NOT(ISNA(VLOOKUP(AS11,Answers!#REF!,2,FALSE))),VLOOKUP(AS11,Answers!#REF!,2,FALSE),\"Help!\"))","v":{"$error":"#REF!"}},{"$error":"#REF!"},{"$error":"#REF!"},"Algeria",{"$f":"IF(AW11=0,\"\",IF(NOT(ISNA(VLOOKUP(AW11,Answers!#REF!,2,FALSE))),VLOOKUP(AW11,Answers!#REF!,2,FALSE),\"Help!\"))","v":{"$error":"#REF!"}},{"$error":"#REF!"},{"$error":"#REF!"},"South Africa",{"$f":"IF(BA11=0,\"\",IF(NOT(ISNA(VLOOKUP(BA11,Answers!#REF!,2,FALSE))),VLOOKUP(BA11,Answers!#REF!,2,FALSE),\"Help!\"))","v":{"$error":"#REF!"}},{"$error":"#REF!"},{"$error":"#REF!"},"Guinea-Bissau",{"$f":"IF(BE11=0,\"\",IF(NOT(ISNA(VLOOKUP(BE11,Answers!#REF!,2,FALSE))),VLOOKUP(BE11,Answers!#REF!,2,FALSE),\"Help!\"))","v":{"$error":"#REF!"}},{"$error":"#REF!"},{"$error":"#REF!"},9,null,{"$error":"#REF!"},{"$error":"#REF!"}]
["cougarslav","Harry S Truman",{"$f":"IF(B12=0,\"\",IF(NOT(ISNA(VLOOKUP(B12,Answers!$A$2:$B$15,2,FALSE))),VLOOKUP(B12,Answers!$A$2:$B$15,2,FALSE),\"Help!\"))","v":"Help!"},{"$error":"#VALUE!"},"eta",{"$f":"IF(E12=0,\"\",IF(NOT(ISNA(VLOOKUP(E12,Answers!#REF!,2,FALSE))),VLOOKUP(E12,Answers!#REF!,2,FALSE),\"Help!\"))","v":{"$error":"#REF!"}},{"$error":"#REF!"},{"$error":"#REF!"},"alpha",{"$f":"IF(I12=0,\"\",IF(NOT(ISNA(VLOOKUP(I12,Answers!#REF!,2,FALSE))),VLOOKUP(I12,Answers!#REF!,2,FALSE),\"Help!\"))","v":{"$error":"#REF!"}},{"$error":"#REF!"},{"$error":"#REF!"},"The Two Gentlemen of Verona",{"$f":"IF(M12=0,\"\",IF(NOT(ISNA(VLOOKUP(M12,Answers!#REF!,2,FALSE))),VLOOKUP(M12,Answers!#REF!,2,FALSE),\"Help!\"))","v":{"$error":"#REF!"}},{"$error":"#REF!"},{"$error":"#REF!"},"As You Like It",{"$f":"IF(Q12=0,\"\",IF(NOT(ISNA(VLOOKUP(Q12,Answers!#REF!,2,FALSE))),VLOOKUP(Q12,Answers!#REF!,2,FALSE),\"Help!\"))","v":{"$error":"#REF!"}},{"$error":"#REF!"},{"$error":"#REF!"},"The Tempest",{"$f":"IF(U12=0,\"\",IF(NOT(ISNA(VLOOKUP(U12,Answers!#REF!,2,FALSE))),VLOOKUP(U12,Answers!#REF!,2,FALSE),\"Help!\"))","v":{"$error":"#REF!"}},{"$error":"#REF!"},{"$error":"#REF!"},"The King's Speech",{"$f":"IF(Y12=0,\"\",IF(NOT(ISNA(VLOOKUP(Y12,Answers!#REF!,3,FALSE))),VLOOKUP(Y12,Answers!#REF!,3,FALSE),\"Help!\"))","v":{"$error":"#REF!"}},{"$error":"#REF!"},{"$error":"#REF!"},"12 Years a Slave",{"$f":"IF(AC12=0,\"\",IF(NOT(ISNA(VLOOKUP(AC12,Answers!#REF!,3,FALSE))),VLOOKUP(AC12,Answers!#REF!,3,FALSE),\"Help!\"))","v":{"$error":"#REF!"}},{"$error":"#REF!"},{"$error":"#REF!"},"Around the World in 80 Days",{"$f":"IF(AG12=0,\"\",IF(NOT(ISNA(VLOOKUP(AG12,Answers!#REF!,3,FALSE))),VLOOKUP(AG12,Answers!#REF!,3,FALSE),\"Help!\"))","v":{"$error":"#REF!"}},{"$error":"#REF!"},{"$error":"#REF!"},"The Life of Emile Zola",{"$f":"IF(AK12=0,\"\",IF(NOT(ISNA(VLOOKUP(AK12,Answers!#REF!,3,FALSE))),VLOOKUP(AK12,Answers!#REF!,3,FALSE),\"Help!\"))","v":{"$error":"#REF!"}},{"$error":"#REF!"},{"$error":"#REF!"},"Cameroon",{"$f":"IF(AO12=0,\"\",IF(NOT(ISNA(VLOOKUP(AO12,Answers!#REF!,2,FALSE))),VLOOKUP(AO12,Answers!#REF!,2,FALSE),\"Help!\"))","v":{"$error":"#REF!"}},{"$error":"#REF!"},{"$error":"#REF!"},"Eritrea",{"$f":"IF(AS12=0,\"\",IF(NOT(ISNA(VLOOKUP(AS12,Answers!#REF!,2,FALSE))),VLOOKUP(AS12,Answers!#REF!,2,FALSE),\"Help!\"))","v":{"$error":"#REF!"}},{"$error":"#REF!"},{"$error":"#REF!"},"Zambia",{"$f":"IF(AW12=0,\"\",IF(NOT(ISNA(VLOOKUP(AW12,Answers!#REF!,2,FALSE))),VLOOKUP(AW12,Answers!#REF!,2,FALSE),\"Help!\"))","v":{"$error":"#REF!"}},{"$error":"#REF!"},{"$error":"#REF!"},"Kenya",{"$f":"IF(BA12=0,\"\",IF(NOT(ISNA(VLOOKUP(BA12,Answers!#REF!,2,FALSE))),VLOOKUP(BA12,Answers!#REF!,2,FALSE),\"Help!\"))","v":{"$error":"#REF!"}},{"$error":"#REF!"},{"$error":"#REF!"},"Togo",{"$f":"IF(BE12=0,\"\",IF(NOT(ISNA(VLOOKUP(BE12,Answers!#REF!,2,FALSE))),VLOOKUP(BE12,Answers!#REF!,2,FALSE),\"Help!\"))","v":{"$error":"#REF!"}},{"$error":"#REF!"},{"$error":"#REF!"},10,null,{"$error":"#REF!"},{"$error":"#REF!"}]
["Creed Bratton","Richard Nixon",{"$f":"IF(B13=0,\"\",IF(NOT(ISNA(VLOOKUP(B13,Answers!$A$2:$B$15,2,FALSE))),VLOOKUP(B13,Answers!$A$2:$B$15,2,FALSE),\"Help!\"))","v":"Help!"},{"$error":"#VALUE!"},"gamma",{"$f":"IF(E13=0,\"\",IF(NOT(ISNA(VLOOKUP(E13,Answers!#REF!,2,FALSE))),VLOOKUP(E13,Answers!#REF!,2,FALSE),\"Help!\"))","v":{"$error":"#REF!"}},{"$error":"#REF!"},{"$error":"#REF!"},"rho",{"$f":"IF(I13=0,\"\",IF(NOT(ISNA(VLOOKUP(I13,Answers!#REF!,2,FALSE))),VLOOKUP(I13,Answers!#REF!,2,FALSE),\"Help!\"))","v":{"$error":"#REF!"}},{"$error":"#REF!"},{"$error":"#REF!"},"King Lear",{"$f":"IF(M13=0,\"\",IF(NOT(ISNA(VLOOKUP(M13,Answers!#REF!,2,FALSE))),VLOOKUP(M13,Answers!#REF!,2,FALSE),\"Help!\"))","v":{"$error":"#REF!"}},{"$error":"#REF!"},{"$error":"#REF!"},"A Midsummer Night's Dream",{"$f":"IF(Q13=0,\"\",IF(NOT(ISNA(VLOOKUP(Q13,Answers!#REF!,2,FALSE))),VLOOKUP(Q13,Answers!#REF!,2,FALSE),\"Help!\"))","v":{"$error":"#REF!"}},{"$error":"#REF!"},{"$error":"#REF!"},"The Tempest",{"$f":"IF(U13=0,\"\",IF(NOT(ISNA(VLOOKUP(U13,Answers!#REF!,2,FALSE))),VLOOKUP(U13,Answers!#REF!,2,FALSE),\"Help!\"))","v":{"$error":"#REF!"}},{"$error":"#REF!"},{"$error":"#REF!"},"The Lord of the Rings: The Return of the King",{"$f":"IF(Y13=0,\"\",IF(NOT(ISNA(VLOOKUP(Y13,Answers!#REF!,3,FALSE))),VLOOKUP(Y13,Answers!#REF!,3,FALSE),\"Help!\"))","v":{"$error":"#REF!"}},{"$error":"#REF!"},{"$error":"#REF!"},"Gone with the Wind",{"$f":"IF(AC13=0,\"\",IF(NOT(ISNA(VLOOKUP(AC13,Answers!#REF!,3,FALSE))),VLOOKUP(AC13,Answers!#REF!,3,FALSE),\"Help!\"))","v":{"$error":"#REF!"}},{"$error":"#REF!"},{"$error":"#REF!"},"The Godfather Part II",{"$f":"IF(AG13=0,\"\",IF(NOT(ISNA(VLOOKUP(AG13,Answers!#REF!,3,FALSE))),VLOOKUP(AG13,Answers!#REF!,3,FALSE),\"Help!\"))","v":{"$error":"#REF!"}},{"$error":"#REF!"},{"$error":"#REF!"},"Chariots of Fire",{"$f":"IF(AK13=0,\"\",IF(NOT(ISNA(VLOOKUP(AK13,Answers!#REF!,3,FALSE))),VLOOKUP(AK13,Answers!#REF!,3,FALSE),\"Help!\"))","v":{"$error":"#REF!"}},{"$error":"#REF!"},{"$error":"#REF!"},"Egypt",{"$f":"IF(AO13=0,\"\",IF(NOT(ISNA(VLOOKUP(AO13,Answers!#REF!,2,FALSE))),VLOOKUP(AO13,Answers!#REF!,2,FALSE),\"Help!\"))","v":{"$error":"#REF!"}},{"$error":"#REF!"},{"$error":"#REF!"},"Benin",{"$f":"IF(AS13=0,\"\",IF(NOT(ISNA(VLOOKUP(AS13,Answers!#REF!,2,FALSE))),VLOOKUP(AS13,Answers!#REF!,2,FALSE),\"Help!\"))","v":{"$error":"#REF!"}},{"$error":"#REF!"},{"$error":"#REF!"},"Burkina Faso",{"$f":"IF(AW13=0,\"\",IF(NOT(ISNA(VLOOKUP(AW13,Answers!#REF!,2,FALSE))),VLOOKUP(AW13,Answers!#REF!,2,FALSE),\"Help!\"))","v":{"$error":"#REF!"}},{"$error":"#REF!"},{"$error":"#REF!"},"Togo",{"$f":"IF(BA13=0,\"\",IF(NOT(ISNA(VLOOKUP(BA13,Answers!#REF!,2,FALSE))),VLOOKUP(BA13,Answers!#REF!,2,FALSE),\"Help!\"))","v":{"$error":"#REF!"}},{"$error":"#REF!"},{"$error":"#REF!"},"Chad",{"$f":"IF(BE13=0,\"\",IF(NOT(ISNA(VLOOKUP(BE13,Answers!#REF!,2,FALSE))),VLOOKUP(BE13,Answers!#REF!,2,FALSE),\"Help!\"))","v":{"$error":"#REF!"}},{"$error":"#REF!"},{"$error":"#REF!"},11,null,{"$error":"#REF!"},{"$error":"#REF!"}]
["bkburner","John Tyler",{"$f":"IF(B14=0,\"\",IF(NOT(ISNA(VLOOKUP(B14,Answers!$A$2:$B$15,2,FALSE))),VLOOKUP(B14,Answers!$A$2:$B$15,2,FALSE),\"Help!\"))","v":"Help!"},{"$error":"#VALUE!"},"Eta",{"$f":"IF(E14=0,\"\",IF(NOT(ISNA(VLOOKUP(E14,Answers!#REF!,2,FALSE))),VLOOKUP(E14,Answers!#REF!,2,FALSE),\"Help!\"))","v":{"$error":"#REF!"}},{"$error":"#REF!"},{"$error":"#REF!"},"Omicron",{"$f":"IF(I14=0,\"\",IF(NOT(ISNA(VLOOKUP(I14,Answers!#REF!,2,FALSE))),VLOOKUP(I14,Answers!#REF!,2,FALSE),\"Help!\"))","v":{"$error":"#REF!"}},{"$error":"#REF!"},{"$error":"#REF!"},"The Two Gentlemen of Verona",{"$f":"IF(M14=0,\"\",IF(NOT(ISNA(VLOOKUP(M14,Answers!#REF!,2,FALSE))),VLOOKUP(M14,Answers!#REF!,2,FALSE),\"Help!\"))","v":{"$error":"#REF!"}},{"$error":"#REF!"},{"$error":"#REF!"},"As You Like It",{"$f":"IF(Q14=0,\"\",IF(NOT(ISNA(VLOOKUP(Q14,Answers!#REF!,2,FALSE))),VLOOKUP(Q14,Answers!#REF!,2,FALSE),\"Help!\"))","v":{"$error":"#REF!"}},{"$error":"#REF!"},{"$error":"#REF!"},"Richard II",{"$f":"IF(U14=0,\"\",IF(NOT(ISNA(VLOOKUP(U14,Answers!#REF!,2,FALSE))),VLOOKUP(U14,Answers!#REF!,2,FALSE),\"Help!\"))","v":{"$error":"#REF!"}},{"$error":"#REF!"},{"$error":"#REF!"},"Gone With The Wind",{"$f":"IF(Y14=0,\"\",IF(NOT(ISNA(VLOOKUP(Y14,Answers!#REF!,3,FALSE))),VLOOKUP(Y14,Answers!#REF!,3,FALSE),\"Help!\"))","v":{"$error":"#REF!"}},{"$error":"#REF!"},{"$error":"#REF!"},"Slumdog Millionaire",{"$f":"Mainframe!$S$1","v":"Question 17"},{"$error":"#VALUE!"},{"$error":"#VALUE!"},"Lawrence of Arabia",{"$f":"IF(AG14=0,\"\",IF(NOT(ISNA(VLOOKUP(AG14,Answers!#REF!,3,FALSE))),VLOOKUP(AG14,Answers!#REF!,3,FALSE),\"Help!\"))","v":{"$error":"#REF!"}},{"$error":"#REF!"},{"$error":"#REF!"},"Terms of Endearment",{"$f":"IF(AK14=0,\"\",IF(NOT(ISNA(VLOOKUP(AK14,Answers!#REF!,3,FALSE))),VLOOKUP(AK14,Answers!#REF!,3,FALSE),\"Help!\"))","v":{"$error":"#REF!"}},{"$error":"#REF!"},{"$error":"#REF!"},"South Africa",{"$f":"IF(AO14=0,\"\",IF(NOT(ISNA(VLOOKUP(AO14,Answers!#REF!,2,FALSE))),VLOOKUP(AO14,Answers!#REF!,2,FALSE),\"Help!\"))","v":{"$error":"#REF!"}},{"$error":"#REF!"},{"$error":"#REF!"},"Ethiopia",{"$f":"IF(AS14=0,\"\",IF(NOT(ISNA(VLOOKUP(AS14,Answers!#REF!,2,FALSE))),VLOOKUP(AS14,Answers!#REF!,2,FALSE),\"Help!\"))","v":{"$error":"#REF!"}},{"$error":"#REF!"},{"$error":"#REF!"},"Senegal",{"$f":"IF(AW14=0,\"\",IF(NOT(ISNA(VLOOKUP(AW14,Answers!#REF!,2,FALSE))),VLOOKUP(AW14,Answers!#REF!,2,FALSE),\"Help!\"))","v":{"$error":"#REF!"}},{"$error":"#REF!"},{"$error":"#REF!"},"Guinea-Bissau",{"$f":"IF(BA14=0,\"\",IF(NOT(ISNA(VLOOKUP(BA14,Answers!#REF!,2,FALSE))),VLOOKUP(BA14,Answers!#REF!,2,FALSE),\"Help!\"))","v":{"$error":"#REF!"}},{"$error":"#REF!"},{"$error":"#REF!"},"Malawi",{"$f":"IF(BE14=0,\"\",IF(NOT(ISNA(VLOOKUP(BE14,Answers!#REF!,2,FALSE))),VLOOKUP(BE14,Answers!#REF!,2,FALSE),\"Help!\"))","v":{"$error":"#REF!"}},{"$error":"#REF!"},{"$error":"#REF!"},12,null,{"$error":"#REF!"},{"$error":"#REF!"}]
["gamawire","Theodore Roosevelt",{"$f":"IF(B15=0,\"\",IF(NOT(ISNA(VLOOKUP(B15,Answers!$A$2:$B$15,2,FALSE))),VLOOKUP(B15,Answers!$A$2:$B$15,2,FALSE),\"Help!\"))","v":"Help!"},{"$error":"#VALUE!"},"Rho",{"$f":"IF(E15=0,\"\",IF(NOT(ISNA(VLOOKUP(E15,Answers!#REF!,2,FALSE))),VLOOKUP(E15,Answers!#REF!,2,FALSE),\"Help!\"))","v":{"$error":"#REF!"}},{"$error":"#REF!"},{"$error":"#REF!"},"Psi",{"$f":"IF(I15=0,\"\",IF(NOT(ISNA(VLOOKUP(I15,Answers!#REF!,2,FALSE))),VLOOKUP(I15,Answers!#REF!,2,FALSE),\"Help!\"))","v":{"$error":"#REF!"}},{"$error":"#REF!"},{"$error":"#REF!"},"The Tempest",{"$f":"IF(M15=0,\"\",IF(NOT(ISNA(VLOOKUP(M15,Answers!#REF!,2,FALSE))),VLOOKUP(M15,Answers!#REF!,2,FALSE),\"Help!\"))","v":{"$error":"#REF!"}},{"$error":"#REF!"},{"$error":"#REF!"},"Twelfth Night",{"$f":"IF(Q15=0,\"\",IF(NOT(ISNA(VLOOKUP(Q15,Answers!#REF!,2,FALSE))),VLOOKUP(Q15,Answers!#REF!,2,FALSE),\"Help!\"))","v":{"$error":"#REF!"}},{"$error":"#REF!"},{"$error":"#REF!"},"Love's Labour's Lost",{"$f":"IF(U15=0,\"\",IF(NOT(ISNA(VLOOKUP(U15,Answers!#REF!,2,FALSE))),VLOOKUP(U15,Answers!#REF!,2,FALSE),\"Help!\"))","v":{"$error":"#REF!"}},{"$error":"#REF!"},{"$error":"#REF!"},"Gone with the Wind",{"$f":"IF(Y15=0,\"\",IF(NOT(ISNA(VLOOKUP(Y15,Answers!#REF!,3,FALSE))),VLOOKUP(Y15,Answers!#REF!,3,FALSE),\"Help!\"))","v":{"$error":"#REF!"}},{"$error":"#REF!"},{"$error":"#REF!"},"Dances with Wolves",{"$f":"IF(AC15=0,\"\",IF(NOT(ISNA(VLOOKUP(AC15,Answers!#REF!,3,FALSE))),VLOOKUP(AC15,Answers!#REF!,3,FALSE),\"Help!\"))","v":{"$error":"#REF!"}},{"$error":"#REF!"},{"$error":"#REF!"},"The Blind Side",{"$f":"Mainframe!$S$1","v":"Question 17"},{"$error":"#VALUE!"},{"$error":"#VALUE!"},"Million Dollar Baby",{"$f":"IF(AK15=0,\"\",IF(NOT(ISNA(VLOOKUP(AK15,Answers!#REF!,3,FALSE))),VLOOKUP(AK15,Answers!#REF!,3,FALSE),\"Help!\"))","v":{"$error":"#REF!"}},{"$error":"#REF!"},{"$error":"#REF!"},"Egypt",{"$f":"IF(AO15=0,\"\",IF(NOT(ISNA(VLOOKUP(AO15,Answers!#REF!,2,FALSE))),VLOOKUP(AO15,Answers!#REF!,2,FALSE),\"Help!\"))","v":{"$error":"#REF!"}},{"$error":"#REF!"},{"$error":"#REF!"},"South Africa",{"$f":"IF(AS15=0,\"\",IF(NOT(ISNA(VLOOKUP(AS15,Answers!#REF!,2,FALSE))),VLOOKUP(AS15,Answers!#REF!,2,FALSE),\"Help!\"))","v":{"$error":"#REF!"}},{"$error":"#REF!"},{"$error":"#REF!"},"Kenya",{"$f":"IF(AW15=0,\"\",IF(NOT(ISNA(VLOOKUP(AW15,Answers!#REF!,2,FALSE))),VLOOKUP(AW15,Answers!#REF!,2,FALSE),\"Help!\"))","v":{"$error":"#REF!"}},{"$error":"#REF!"},{"$error":"#REF!"},"Namibia",{"$f":"IF(BA15=0,\"\",IF(NOT(ISNA(VLOOKUP(BA15,Answers!#REF!,2,FALSE))),VLOOKUP(BA15,Answers!#REF!,2,FALSE),\"Help!\"))","v":{"$error":"#REF!"}},{"$error":"#REF!"},{"$error":"#REF!"},"Nigeria",{"$f":"IF(BE15=0,\"\",IF(NOT(ISNA(VLOOKUP(BE15,Answers!#REF!,2,FALSE))),VLOOKUP(BE15,Answers!#REF!,2,FALSE),\"Help!\"))","v":{"$error":"#REF!"}},{"$error":"#REF!"},{"$error":"#REF!"},{"$error":"#REF!"},null,{"$error":"#REF!"},{"$error":"#REF!"}]
["Magna","Theodore Roosevelt",{"$f":"IF(B16=0,\"\",IF(NOT(ISNA(VLOOKUP(B16,Answers!$A$2:$B$15,2,FALSE))),VLOOKUP(B16,Answers!$A$2:$B$15,2,FALSE),\"Help!\"))","v":"Help!"},{"$error":"#VALUE!"},"rho",{"$f":"IF(E16=0,\"\",IF(NOT(ISNA(VLOOKUP(E16,Answers!#REF!,2,FALSE))),VLOOKUP(E16,Answers!#REF!,2,FALSE),\"Help!\"))","v":{"$error":"#REF!"}},{"$error":"#REF!"},{"$error":"#REF!"},"psi",{"$f":"IF(I16=0,\"\",IF(NOT(ISNA(VLOOKUP(I16,Answers!#REF!,2,FALSE))),VLOOKUP(I16,Answers!#REF!,2,FALSE),\"Help!\"))","v":{"$error":"#REF!"}},{"$error":"#REF!"},{"$error":"#REF!"},"Measure for Measure",{"$f":"IF(M16=0,\"\",IF(NOT(ISNA(VLOOKUP(M16,Answers!#REF!,2,FALSE))),VLOOKUP(M16,Answers!#REF!,2,FALSE),\"Help!\"))","v":{"$error":"#REF!"}},{"$error":"#REF!"},{"$error":"#REF!"},"The Two Gentlemen of Verona",{"$f":"IF(Q16=0,\"\",IF(NOT(ISNA(VLOOKUP(Q16,Answers!#REF!,2,FALSE))),VLOOKUP(Q16,Answers!#REF!,2,FALSE),\"Help!\"))","v":{"$error":"#REF!"}},{"$error":"#REF!"},{"$error":"#REF!"},"Troilus and Cressida",{"$f":"IF(U16=0,\"\",IF(NOT(ISNA(VLOOKUP(U16,Answers!#REF!,2,FALSE))),VLOOKUP(U16,Answers!#REF!,2,FALSE),\"Help!\"))","v":{"$error":"#REF!"}},{"$error":"#REF!"},{"$error":"#REF!"},"All About Eve",{"$f":"IF(Y16=0,\"\",IF(NOT(ISNA(VLOOKUP(Y16,Answers!#REF!,3,FALSE))),VLOOKUP(Y16,Answers!#REF!,3,FALSE),\"Help!\"))","v":{"$error":"#REF!"}},{"$error":"#REF!"},{"$error":"#REF!"},"One Flew Over the Cuckoo's Nest",{"$f":"IF(AC16=0,\"\",IF(NOT(ISNA(VLOOKUP(AC16,Answers!#REF!,3,FALSE))),VLOOKUP(AC16,Answers!#REF!,3,FALSE),\"Help!\"))","v":{"$error":"#REF!"}},{"$error":"#REF!"},{"$error":"#REF!"},"The Greatest Show on Earth",{"$f":"IF(AG16=0,\"\",IF(NOT(ISNA(VLOOKUP(AG16,Answers!#REF!,3,FALSE))),VLOOKUP(AG16,Answers!#REF!,3,FALSE),\"Help!\"))","v":{"$error":"#REF!"}},{"$error":"#REF!"},{"$error":"#REF!"},"The Lost Weekend",{"$f":"IF(AK16=0,\"\",IF(NOT(ISNA(VLOOKUP(AK16,Answers!#REF!,3,FALSE))),VLOOKUP(AK16,Answers!#REF!,3,FALSE),\"Help!\"))","v":{"$error":"#REF!"}},{"$error":"#REF!"},{"$error":"#REF!"},"Ethiopia",{"$f":"IF(AO16=0,\"\",IF(NOT(ISNA(VLOOKUP(AO16,Answers!#REF!,2,FALSE))),VLOOKUP(AO16,Answers!#REF!,2,FALSE),\"Help!\"))","v":{"$error":"#REF!"}},{"$error":"#REF!"},{"$error":"#REF!"},"Egypt",{"$f":"IF(AS16=0,\"\",IF(NOT(ISNA(VLOOKUP(AS16,Answers!#REF!,2,FALSE))),VLOOKUP(AS16,Answers!#REF!,2,FALSE),\"Help!\"))","v":{"$error":"#REF!"}},{"$error":"#REF!"},{"$error":"#REF!"},"Central African Republic",{"$f":"IF(AW16=0,\"\",IF(NOT(ISNA(VLOOKUP(AW16,Answers!#REF!,2,FALSE))),VLOOKUP(AW16,Answers!#REF!,2,FALSE),\"Help!\"))","v":{"$error":"#REF!"}},{"$error":"#REF!"},{"$error":"#REF!"},"Namibia",{"$f":"IF(BA16=0,\"\",IF(NOT(ISNA(VLOOKUP(BA16,Answers!#REF!,2,FALSE))),VLOOKUP(BA16,Answers!#REF!,2,FALSE),\"Help!\"))","v":{"$error":"#REF!"}},{"$error":"#REF!"},{"$error":"#REF!"},"Gabon",{"$f":"IF(BE16=0,\"\",IF(NOT(ISNA(VLOOKUP(BE16,Answers!#REF!,2,FALSE))),VLOOKUP(BE16,Answers!#REF!,2,FALSE),\"Help!\"))","v":{"$error":"#REF!"}},{"$error":"#REF!"},{"$error":"#REF!"},{"$error":"#REF!"},null,{"$error":"#REF!"},{"$error":"#REF!"}]
["dnbguy","Calvin Coolidge",{"$f":"IF(B17=0,\"\",IF(NOT(ISNA(VLOOKUP(B17,Answers!$A$2:$B$15,2,FALSE))),VLOOKUP(B17,Answers!$A$2:$B$15,2,FALSE),\"Help!\"))","v":"Help!"},{"$error":"#VALUE!"},"eta",{"$f":"IF(E17=0,\"\",IF(NOT(ISNA(VLOOKUP(E17,Answers!#REF!,2,FALSE))),VLOOKUP(E17,Answers!#REF!,2,FALSE),\"Help!\"))","v":{"$error":"#REF!"}},{"$error":"#REF!"},{"$error":"#REF!"},"mu",{"$f":"IF(I17=0,\"\",IF(NOT(ISNA(VLOOKUP(I17,Answers!#REF!,2,FALSE))),VLOOKUP(I17,Answers!#REF!,2,FALSE),\"Help!\"))","v":{"$error":"#REF!"}},{"$error":"#REF!"},{"$error":"#REF!"},"The Tempest",{"$f":"IF(M17=0,\"\",IF(NOT(ISNA(VLOOKUP(M17,Answers!#REF!,2,FALSE))),VLOOKUP(M17,Answers!#REF!,2,FALSE),\"Help!\"))","v":{"$error":"#REF!"}},{"$error":"#REF!"},{"$error":"#REF!"},"Titus Andronicus",{"$f":"IF(Q17=0,\"\",IF(NOT(ISNA(VLOOKUP(Q17,Answers!#REF!,2,FALSE))),VLOOKUP(Q17,Answers!#REF!,2,FALSE),\"Help!\"))","v":{"$error":"#REF!"}},{"$error":"#REF!"},{"$error":"#REF!"},"Troilus and Cressida",{"$f":"IF(U17=0,\"\",IF(NOT(ISNA(VLOOKUP(U17,Answers!#REF!,2,FALSE))),VLOOKUP(U17,Answers!#REF!,2,FALSE),\"Help!\"))","v":{"$error":"#REF!"}},{"$error":"#REF!"},{"$error":"#REF!"},"Saving Private Ryan",{"$f":"Mainframe!$S$1","v":"Question 17"},{"$error":"#VALUE!"},{"$error":"#VALUE!"},"The Hurt Locker",{"$f":"IF(AC17=0,\"\",IF(NOT(ISNA(VLOOKUP(AC17,Answers!#REF!,3,FALSE))),VLOOKUP(AC17,Answers!#REF!,3,FALSE),\"Help!\"))","v":{"$error":"#REF!"}},{"$error":"#REF!"},{"$error":"#REF!"},"From Here to Eternity",{"$f":"IF(AG17=0,\"\",IF(NOT(ISNA(VLOOKUP(AG17,Answers!#REF!,3,FALSE))),VLOOKUP(AG17,Answers!#REF!,3,FALSE),\"Help!\"))","v":{"$error":"#REF!"}},{"$error":"#REF!"},{"$error":"#REF!"},"Dances with Wolves",{"$f":"IF(AK17=0,\"\",IF(NOT(ISNA(VLOOKUP(AK17,Answers!#REF!,3,FALSE))),VLOOKUP(AK17,Answers!#REF!,3,FALSE),\"Help!\"))","v":{"$error":"#REF!"}},{"$error":"#REF!"},{"$error":"#REF!"},"Egypt",{"$f":"IF(AO17=0,\"\",IF(NOT(ISNA(VLOOKUP(AO17,Answers!#REF!,2,FALSE))),VLOOKUP(AO17,Answers!#REF!,2,FALSE),\"Help!\"))","v":{"$error":"#REF!"}},{"$error":"#REF!"},{"$error":"#REF!"},"Comoros",{"$f":"IF(AS17=0,\"\",IF(NOT(ISNA(VLOOKUP(AS17,Answers!#REF!,2,FALSE))),VLOOKUP(AS17,Answers!#REF!,2,FALSE),\"Help!\"))","v":{"$error":"#REF!"}},{"$error":"#REF!"},{"$error":"#REF!"},"Mauritania",{"$f":"IF(AW17=0,\"\",IF(NOT(ISNA(VLOOKUP(AW17,Answers!#REF!,2,FALSE))),VLOOKUP(AW17,Answers!#REF!,2,FALSE),\"Help!\"))","v":{"$error":"#REF!"}},{"$error":"#REF!"},{"$error":"#REF!"},"Mauritius",{"$f":"IF(BA17=0,\"\",IF(NOT(ISNA(VLOOKUP(BA17,Answers!#REF!,2,FALSE))),VLOOKUP(BA17,Answers!#REF!,2,FALSE),\"Help!\"))","v":{"$error":"#REF!"}},{"$error":"#REF!"},{"$error":"#REF!"},"Benin",{"$f":"IF(BE17=0,\"\",IF(NOT(ISNA(VLOOKUP(BE17,Answers!#REF!,2,FALSE))),VLOOKUP(BE17,Answers!#REF!,2,FALSE),\"Help!\"))","v":{"$error":"#REF!"}},{"$error":"#REF!"},{"$error":"#REF!"},15,null,{"$error":"#REF!"},{"$error":"#REF!"}]
[]
[{"$f":"Mainframe!B17","v":0},{"$f":"Mainframe!C17","v":0},{"$f":"IF(B19=0,\"\",IF(NOT(ISNA(VLOOKUP(B19,Answers!$A$2:$B$15,2,FALSE))),VLOOKUP(B19,Answers!$A$2:$B$15,2,FALSE),\"Help!\"))","v":""},{"$f":"IF(C19=\"\",\"\",C19*B$2)","v":""},{"$f":"Mainframe!D17","v":0},{"$f":"IF(E19=0,\"\",IF(NOT(ISNA(VLOOKUP(E19,Answers!#REF!,2,FALSE))),VLOOKUP(E19,Answers!#REF!,2,FALSE),\"Help!\"))","v":""},{"$f":"IF(F19=\"\",\"\",F19*E$2)","v":""},{"$f":"IF(G19=\"\",\"\",D19+G19)","v":""},{"$f":"Mainframe!E17","v":0},{"$f":"IF(I19=0,\"\",IF(NOT(ISNA(VLOOKUP(I19,Answers!#REF!,2,FALSE))),VLOOKUP(I19,Answers!#REF!,2,FALSE),\"Help!\"))","v":""},{"$f":"IF(J19=\"\",\"\",J19*I$2)","v":""},{"$f":"IF(K19=\"\",\"\",H19+K19)","v":""},{"$f":"Mainframe!F17","v":0},{"$f":"IF(M19=0,\"\",IF(NOT(ISNA(VLOOKUP(M19,Answers!#REF!,2,FALSE))),VLOOKUP(M19,Answers!#REF!,2,FALSE),\"Help!\"))","v":""},{"$f":"IF(N19=\"\",\"\",N19*M$2)","v":""},{"$f":"IF(O19=\"\",\"\",L19+O19)","v":""},{"$f":"Mainframe!G17","v":0},{"$f":"IF(Q19=0,\"\",IF(NOT(ISNA(VLOOKUP(Q19,Answers!#REF!,2,FALSE))),VLOOKUP(Q19,Answers!#REF!,2,FALSE),\"Help!\"))","v":""},{"$f":"IF(R19=\"\",\"\",R19*Q$2)","v":""},{"$f":"IF(S19=\"\",\"\",P19+S19)","v":""},{"$f":"Mainframe!H17","v":0},{"$f":"IF(U19=0,\"\",IF(NOT(ISNA(VLOOKUP(U19,Answers!#REF!,2,FALSE))),VLOOKUP(U19,Answers!#REF!,2,FALSE),\"Help!\"))","v":""},{"$f":"IF(V19=\"\",\"\",V19*U$2)","v":""},{"$f":"IF(W19=\"\",\"\",T19+W19)","v":""},{"$f":"Mainframe!I17","v":0},{"$f":"IF(Y19=0,\"\",IF(NOT(ISNA(VLOOKUP(Y19,Answers!#REF!,3,FALSE))),VLOOKUP(Y19,Answers!#REF!,3,FALSE),\"Help!\"))","v":""},{"$f":"IF(Z19=\"\",\"\",Z19*Y$2)","v":""},{"$f":"IF(AA19=\"\",\"\",X19+AA19)","v":""},{"$f":"Mainframe!J17","v":0},{"$f":"IF(AC19=0,\"\",IF(NOT(ISNA(VLOOKUP(AC19,Answers!#REF!,3,FALSE))),VLOOKUP(AC19,Answers!#REF!,3,FALSE),\"Help!\"))","v":""},{"$f":"IF(AD19=\"\",\"\",AD19*AC$2)","v":""},{"$f":"IF(AE19=\"\",\"\",AB19+AE19)","v":""},{"$f":"Mainframe!K17","v":0},{"$f":"IF(AG19=0,\"\",IF(NOT(ISNA(VLOOKUP(AG19,Answers!#REF!,3,FALSE))),VLOOKUP(AG19,Answers!#REF!,3,FALSE),\"Help!\"))","v":""},{"$f":"IF(AH19=\"\",\"\",AH19*AG$2)","v":""},{"$f":"IF(AI19=\"\",\"\",AF19+AI19)","v":""},{"$f":"Mainframe!L17","v":0},{"$f":"IF(AK19=0,\"\",IF(NOT(ISNA(VLOOKUP(AK19,Answers!#REF!,3,FALSE))),VLOOKUP(AK19,Answers!#REF!,3,FALSE),\"Help!\"))","v":""},{"$f":"IF(AL19=\"\",\"\",AL19*AK$2)","v":""},{"$f":"IF(AM19=\"\",\"\",AJ19+AM19)","v":""},{"$f":"Mainframe!M17","v":0},{"$f":"IF(AO19=0,\"\",IF(NOT(ISNA(VLOOKUP(AO19,Answers!#REF!,2,FALSE))),VLOOKUP(AO19,Answers!#REF!,2,FALSE),\"Help!\"))","v":""},{"$f":"IF(AP19=\"\",\"\",AP19*AO$2)","v":""},{"$f":"IF(AQ19=\"\",\"\",AN19+AQ19)","v":""},{"$f":"Mainframe!N17","v":0},{"$f":"IF(AS19=0,\"\",IF(NOT(ISNA(VLOOKUP(AS19,Answers!#REF!,2,FALSE))),VLOOKUP(AS19,Answers!#REF!,2,FALSE),\"Help!\"))","v":""},{"$f":"IF(AT19=\"\",\"\",AT19*AS$2)","v":""},{"$f":"IF(AU19=\"\",\"\",AR19+AU19)","v":""},{"$f":"Mainframe!O17","v":0},{"$f":"IF(AW19=0,\"\",IF(NOT(ISNA(VLOOKUP(AW19,Answers!#REF!,2,FALSE))),VLOOKUP(AW19,Answers!#REF!,2,FALSE),\"Help!\"))","v":""},{"$f":"IF(AX19=\"\",\"\",AX19*AW$2)","v":""},{"$f":"IF(AY19=\"\",\"\",AV19+AY19)","v":""},{"$f":"Mainframe!P17","v":0},{"$f":"IF(BA19=0,\"\",IF(NOT(ISNA(VLOOKUP(BA19,Answers!#REF!,2,FALSE))),VLOOKUP(BA19,Answers!#REF!,2,FALSE),\"Help!\"))","v":""},{"$f":"IF(BB19=\"\",\"\",BB19*BA$2)","v":""},{"$f":"IF(BC19=\"\",\"\",AZ19+BC19)","v":""},{"$f":"Mainframe!Q17","v":0},{"$f":"IF(BE19=0,\"\",IF(NOT(ISNA(VLOOKUP(BE19,Answers!#REF!,2,FALSE))),VLOOKUP(BE19,Answers!#REF!,2,FALSE),\"Help!\"))","v":""},{"$f":"IF(BF19=\"\",\"\",BF19*BE$2)","v":""},{"$f":"IF(BG19=\"\",\"\",BD19+BG19)","v":""},"",null,{"$f":"IF(INDEX($A:$BH,ROW(),1)=0,\"\",IF(INDEX($A:$BH,ROW(),4*$BL$1)=INDEX($A:$BH,ROW()-1,4*$BL$1),BK17,ROW()-2))","v":""},{"$f":"IF(A19=0,\"\",CONCATENATE(BK19, \". \", INDEX($A:$BH,ROW(),1), \" — \", INDEX($A:$BH,ROW(),4*$BL$1-4), \" + \", INDEX($A:$BH,ROW(),4*$BL$1-1), \" = [b]\", INDEX($A:$BH,ROW(),4*$BL$1), \"[/b] pts (\", BJ19, \")\"))","v":""}]
[{"$f":"Mainframe!B18","v":0},{"$f":"Mainframe!C18","v":0},{"$f":"IF(B20=0,\"\",IF(NOT(ISNA(VLOOKUP(B20,Answers!$A$2:$B$15,2,FALSE))),VLOOKUP(B20,Answers!$A$2:$B$15,2,FALSE),\"Help!\"))","v":""},"",{"$f":"Mainframe!D18","v":0},{"$f":"IF(E20=0,\"\",IF(NOT(ISNA(VLOOKUP(E20,Answers!#REF!,2,FALSE))),VLOOKUP(E20,Answers!#REF!,2,FALSE),\"Help!\"))","v":""},"","",{"$f":"Mainframe!E18","v":0},{"$f":"IF(I20=0,\"\",IF(NOT(ISNA(VLOOKUP(I20,Answers!#REF!,2,FALSE))),VLOOKUP(I20,Answers!#REF!,2,FALSE),\"Help!\"))","v":""},"","",{"$f":"Mainframe!F18","v":0},{"$f":"IF(M20=0,\"\",IF(NOT(ISNA(VLOOKUP(M20,Answers!#REF!,2,FALSE))),VLOOKUP(M20,Answers!#REF!,2,FALSE),\"Help!\"))","v":""},"","",{"$f":"Mainframe!G18","v":0},{"$f":"IF(Q20=0,\"\",IF(NOT(ISNA(VLOOKUP(Q20,Answers!#REF!,2,FALSE))),VLOOKUP(Q20,Answers!#REF!,2,FALSE),\"Help!\"))","v":""},"","",{"$f":"Mainframe!H18","v":0},{"$f":"IF(U20=0,\"\",IF(NOT(ISNA(VLOOKUP(U20,Answers!#REF!,2,FALSE))),VLOOKUP(U20,Answers!#REF!,2,FALSE),\"Help!\"))","v":""},"","",{"$f":"Mainframe!I18","v":0},{"$f":"IF(Y20=0,\"\",IF(NOT(ISNA(VLOOKUP(Y20,Answers!#REF!,3,FALSE))),VLOOKUP(Y20,Answers!#REF!,3,FALSE),\"Help!\"))","v":""},"","",{"$f":"Mainframe!J18","v":0},{"$f":"IF(AC20=0,\"\",IF(NOT(ISNA(VLOOKUP(AC20,Answers!#REF!,3,FALSE))),VLOOKUP(AC20,Answers!#REF!,3,FALSE),\"Help!\"))","v":""},"","",{"$f":"Mainframe!K18","v":0},{"$f":"IF(AG20=0,\"\",IF(NOT(ISNA(VLOOKUP(AG20,Answers!#REF!,3,FALSE))),VLOOKUP(AG20,Answers!#REF!,3,FALSE),\"Help!\"))","v":""},"","",{"$f":"Mainframe!L18","v":0},{"$f":"IF(AK20=0,\"\",IF(NOT(ISNA(VLOOKUP(AK20,Answers!#REF!,3,FALSE))),VLOOKUP(AK20,Answers!#REF!,3,FALSE),\"Help!\"))","v":""},"","",{"$f":"Mainframe!M18","v":0},{"$f":"IF(AO20=0,\"\",IF(NOT(ISNA(VLOOKUP(AO20,Answers!#REF!,2,FALSE))),VLOOKUP(AO20,Answers!#REF!,2,FALSE),\"Help!\"))","v":""},"","",{"$f":"Mainframe!N18","v":0},{"$f":"IF(AS20=0,\"\",IF(NOT(ISNA(VLOOKUP(AS20,Answers!#REF!,2,FALSE))),VLOOKUP(AS20,Answers!#REF!,2,FALSE),\"Help!\"))","v":""},"","",{"$f":"Mainframe!O18","v":0},{"$f":"IF(AW20=0,\"\",IF(NOT(ISNA(VLOOKUP(AW20,Answers!#REF!,2,FALSE))),VLOOKUP(AW20,Answers!#REF!,2,FALSE),\"Help!\"))","v":""},"","",{"$f":"Mainframe!P18","v":0},{"$f":"IF(BA20=0,\"\",IF(NOT(ISNA(VLOOKUP(BA20,Answers!#REF!,2,FALSE))),VLOOKUP(BA20,Answers!#REF!,2,FALSE),\"Help!\"))","v":""},"","",{"$f":"Mainframe!Q18","v":0},{"$f":"IF(BE20=0,\"\",IF(NOT(ISNA(VLOOKUP(BE20,Answers!#REF!,2,FALSE))),VLOOKUP(BE20,Answers!#REF!,2,FALSE),\"Help!\"))","v":""},"","","",null,{"$f":"IF(INDEX($A:$BH,ROW(),1)=0,\"\",IF(INDEX($A:$BH,ROW(),4*$BL$1)=INDEX($A:$BH,ROW()-1,4*$BL$1),BK19,ROW()-2))","v":""},""]
[{"$f":"Mainframe!B19","v":0},{"$f":"Mainframe!C19","v":0},{"$f":"IF(B21=0,\"\",IF(NOT(ISNA(VLOOKUP(B21,Answers!$A$2:$B$15,2,FALSE))),VLOOKUP(B21,Answers!$A$2:$B$15,2,FALSE),\"Help!\"))","v":""},"",{"$f":"Mainframe!D19","v":0},{"$f":"IF(E21=0,\"\",IF(NOT(ISNA(VLOOKUP(E21,Answers!#REF!,2,FALSE))),VLOOKUP(E21,Answers!#REF!,2,FALSE),\"Help!\"))","v":""},"","",{"$f":"Mainframe!E19","v":0},{"$f":"IF(I21=0,\"\",IF(NOT(ISNA(VLOOKUP(I21,Answers!#REF!,2,FALSE))),VLOOKUP(I21,Answers!#REF!,2,FALSE),\"Help!\"))","v":""},"","",{"$f":"Mainframe!F19","v":0},{"$f":"IF(M21=0,\"\",IF(NOT(ISNA(VLOOKUP(M21,Answers!#REF!,2,FALSE))),VLOOKUP(M21,Answers!#REF!,2,FALSE),\"Help!\"))","v":""},"","",{"$f":"Mainframe!G19","v":0},{"$f":"IF(Q21=0,\"\",IF(NOT(ISNA(VLOOKUP(Q21,Answers!#REF!,2,FALSE))),VLOOKUP(Q21,Answers!#REF!,2,FALSE),\"Help!\"))","v":""},"","",{"$f":"Mainframe!H19","v":0},{"$f":"IF(U21=0,\"\",IF(NOT(ISNA(VLOOKUP(U21,Answers!#REF!,2,FALSE))),VLOOKUP(U21,Answers!#REF!,2,FALSE),\"Help!\"))","v":""},"","",{"$f":"Mainframe!I19","v":0},{"$f":"IF(Y21=0,\"\",IF(NOT(ISNA(VLOOKUP(Y21,Answers!#REF!,3,FALSE))),VLOOKUP(Y21,Answers!#REF!,3,FALSE),\"Help!\"))","v":""},"","",{"$f":"Mainframe!J19","v":0},{"$f":"IF(AC21=0,\"\",IF(NOT(ISNA(VLOOKUP(AC21,Answers!#REF!,3,FALSE))),VLOOKUP(AC21,Answers!#REF!,3,FALSE),\"Help!\"))","v":""},"","",{"$f":"Mainframe!K19","v":0},{"$f":"IF(AG21=0,\"\",IF(NOT(ISNA(VLOOKUP(AG21,Answers!#REF!,3,FALSE))),VLOOKUP(AG21,Answers!#REF!,3,FALSE),\"Help!\"))","v":""},"","",{"$f":"Mainframe!L19","v":0},{"$f":"IF(AK21=0,\"\",IF(NOT(ISNA(VLOOKUP(AK21,Answers!#REF!,3,FALSE))),VLOOKUP(AK21,Answers!#REF!,3,FALSE),\"Help!\"))","v":""},"","",{"$f":"Mainframe!M19","v":0},{"$f":"IF(AO21=0,\"\",IF(NOT(ISNA(VLOOKUP(AO21,Answers!#REF!,2,FALSE))),VLOOKUP(AO21,Answers!#REF!,2,FALSE),\"Help!\"))","v":""},"","",{"$f":"Mainframe!N19","v":0},{"$f":"IF(AS21=0,\"\",IF(NOT(ISNA(VLOOKUP(AS21,Answers!#REF!,2,FALSE))),VLOOKUP(AS21,Answers!#REF!,2,FALSE),\"Help!\"))","v":""},"","",{"$f":"Mainframe!O19","v":0},{"$f":"IF(AW21=0,\"\",IF(NOT(ISNA(VLOOKUP(AW21,Answers!#REF!,2,FALSE))),VLOOKUP(AW21,Answers!#REF!,2,FALSE),\"Help!\"))","v":""},"","",{"$f":"Mainframe!P19","v":0},{"$f":"IF(BA21=0,\"\",IF(NOT(ISNA(VLOOKUP(BA21,Answers!#REF!,2,FALSE))),VLOOKUP(BA21,Answers!#REF!,2,FALSE),\"Help!\"))","v":""},"","",{"$f":"Mainframe!Q19","v":0},{"$f":"IF(BE21=0,\"\",IF(NOT(ISNA(VLOOKUP(BE21,Answers!#REF!,2,FALSE))),VLOOKUP(BE21,Answers!#REF!,2,FALSE),\"Help!\"))","v":""},"","","",null,"",""]
[{"$f":"Mainframe!B20","v":0},{"$f":"Mainframe!C20","v":0},{"$f":"IF(B22=0,\"\",IF(NOT(ISNA(VLOOKUP(B22,Answers!$A$2:$B$15,2,FALSE))),VLOOKUP(B22,Answers!$A$2:$B$15,2,FALSE),\"Help!\"))","v":""},"",{"$f":"Mainframe!D20","v":0},{"$f":"IF(E22=0,\"\",IF(NOT(ISNA(VLOOKUP(E22,Answers!#REF!,2,FALSE))),VLOOKUP(E22,Answers!#REF!,2,FALSE),\"Help!\"))","v":""},"","",{"$f":"Mainframe!E20","v":0},{"$f":"IF(I22=0,\"\",IF(NOT(ISNA(VLOOKUP(I22,Answers!#REF!,2,FALSE))),VLOOKUP(I22,Answers!#REF!,2,FALSE),\"Help!\"))","v":""},"","",{"$f":"Mainframe!F20","v":0},{"$f":"IF(M22=0,\"\",IF(NOT(ISNA(VLOOKUP(M22,Answers!#REF!,2,FALSE))),VLOOKUP(M22,Answers!#REF!,2,FALSE),\"Help!\"))","v":""},"","",{"$f":"Mainframe!G20","v":0},{"$f":"IF(Q22=0,\"\",IF(NOT(ISNA(VLOOKUP(Q22,Answers!#REF!,2,FALSE))),VLOOKUP(Q22,Answers!#REF!,2,FALSE),\"Help!\"))","v":""},"","",{"$f":"Mainframe!H20","v":0},{"$f":"IF(U22=0,\"\",IF(NOT(ISNA(VLOOKUP(U22,Answers!#REF!,2,FALSE))),VLOOKUP(U22,Answers!#REF!,2,FALSE),\"Help!\"))","v":""},"","",{"$f":"Mainframe!I20","v":0},{"$f":"IF(Y22=0,\"\",IF(NOT(ISNA(VLOOKUP(Y22,Answers!#REF!,3,FALSE))),VLOOKUP(Y22,Answers!#REF!,3,FALSE),\"Help!\"))","v":""},"","",{"$f":"Mainframe!J20","v":0},{"$f":"IF(AC22=0,\"\",IF(NOT(ISNA(VLOOKUP(AC22,Answers!#REF!,3,FALSE))),VLOOKUP(AC22,Answers!#REF!,3,FALSE),\"Help!\"))","v":""},"","",{"$f":"Mainframe!K20","v":0},{"$f":"IF(AG22=0,\"\",IF(NOT(ISNA(VLOOKUP(AG22,Answers!#REF!,3,FALSE))),VLOOKUP(AG22,Answers!#REF!,3,FALSE),\"Help!\"))","v":""},"","",{"$f":"Mainframe!L20","v":0},{"$f":"IF(AK22=0,\"\",IF(NOT(ISNA(VLOOKUP(AK22,Answers!#REF!,3,FALSE))),VLOOKUP(AK22,Answers!#REF!,3,FALSE),\"Help!\"))","v":""},"","",{"$f":"Mainframe!M20","v":0},{"$f":"IF(AO22=0,\"\",IF(NOT(ISNA(VLOOKUP(AO22,Answers!#REF!,2,FALSE))),VLOOKUP(AO22,Answers!#REF!,2,FALSE),\"Help!\"))","v":""},"","",{"$f":"Mainframe!N20","v":0},{"$f":"IF(AS22=0,\"\",IF(NOT(ISNA(VLOOKUP(AS22,Answers!#REF!,2,FALSE))),VLOOKUP(AS22,Answers!#REF!,2,FALSE),\"Help!\"))","v":""},"","",{"$f":"Mainframe!O20","v":0},{"$f":"IF(AW22=0,\"\",IF(NOT(ISNA(VLOOKUP(AW22,Answers!#REF!,2,FALSE))),VLOOKUP(AW22,Answers!#REF!,2,FALSE),\"Help!\"))","v":""},"","",{"$f":"Mainframe!P20","v":0},{"$f":"IF(BA22=0,\"\",IF(NOT(ISNA(VLOOKUP(BA22,Answers!#REF!,2,FALSE))),VLOOKUP(BA22,Answers!#REF!,2,FALSE),\"Help!\"))","v":""},"","",{"$f":"Mainframe!Q20","v":0},{"$f":"IF(BE22=0,\"\",IF(NOT(ISNA(VLOOKUP(BE22,Answers!#REF!,2,FALSE))),VLOOKUP(BE22,Answers!#REF!,2,FALSE),\"Help!\"))","v":""},"","","",null,"",""]
[{"$f":"Mainframe!B21","v":0},{"$f":"Mainframe!C21","v":0},{"$f":"IF(B23=0,\"\",IF(NOT(ISNA(VLOOKUP(B23,Answers!$A$2:$B$15,2,FALSE))),VLOOKUP(B23,Answers!$A$2:$B$15,2,FALSE),\"Help!\"))","v":""},"",{"$f":"Mainframe!D21","v":0},{"$f":"IF(E23=0,\"\",IF(NOT(ISNA(VLOOKUP(E23,Answers!#REF!,2,FALSE))),VLOOKUP(E23,Answers!#REF!,2,FALSE),\"Help!\"))","v":""},"","",{"$f":"Mainframe!E21","v":0},{"$f":"IF(I23=0,\"\",IF(NOT(ISNA(VLOOKUP(I23,Answers!#REF!,2,FALSE))),VLOOKUP(I23,Answers!#REF!,2,FALSE),\"Help!\"))","v":""},"","",{"$f":"Mainframe!F21","v":0},{"$f":"IF(M23=0,\"\",IF(NOT(ISNA(VLOOKUP(M23,Answers!#REF!,2,FALSE))),VLOOKUP(M23,Answers!#REF!,2,FALSE),\"Help!\"))","v":""},"","",{"$f":"Mainframe!G21","v":0},{"$f":"IF(Q23=0,\"\",IF(NOT(ISNA(VLOOKUP(Q23,Answers!#REF!,2,FALSE))),VLOOKUP(Q23,Answers!#REF!,2,FALSE),\"Help!\"))","v":""},"","",{"$f":"Mainframe!H21","v":0},{"$f":"IF(U23=0,\"\",IF(NOT(ISNA(VLOOKUP(U23,Answers!#REF!,2,FALSE))),VLOOKUP(U23,Answers!#REF!,2,FALSE),\"Help!\"))","v":""},"","",{"$f":"Mainframe!I21","v":0},{"$f":"IF(Y23=0,\"\",IF(NOT(ISNA(VLOOKUP(Y23,Answers!#REF!,3,FALSE))),VLOOKUP(Y23,Answers!#REF!,3,FALSE),\"Help!\"))","v":""},"","",{"$f":"Mainframe!J21","v":0},{"$f":"IF(AC23=0,\"\",IF(NOT(ISNA(VLOOKUP(AC23,Answers!#REF!,3,FALSE))),VLOOKUP(AC23,Answers!#REF!,3,FALSE),\"Help!\"))","v":""},"","",{"$f":"Mainframe!K21","v":0},{"$f":"IF(AG23=0,\"\",IF(NOT(ISNA(VLOOKUP(AG23,Answers!#REF!,3,FALSE))),VLOOKUP(AG23,Answers!#REF!,3,FALSE),\"Help!\"))","v":""},"","",{"$f":"Mainframe!L21","v":0},{"$f":"IF(AK23=0,\"\",IF(NOT(ISNA(VLOOKUP(AK23,Answers!#REF!,3,FALSE))),VLOOKUP(AK23,Answers!#REF!,3,FALSE),\"Help!\"))","v":""},"","",{"$f":"Mainframe!M21","v":0},{"$f":"IF(AO23=0,\"\",IF(NOT(ISNA(VLOOKUP(AO23,Answers!#REF!,2,FALSE))),VLOOKUP(AO23,Answers!#REF!,2,FALSE),\"Help!\"))","v":""},"","",{"$f":"Mainframe!N21","v":0},{"$f":"IF(AS23=0,\"\",IF(NOT(ISNA(VLOOKUP(AS23,Answers!#REF!,2,FALSE))),VLOOKUP(AS23,Answers!#REF!,2,FALSE),\"Help!\"))","v":""},"","",{"$f":"Mainframe!O21","v":0},{"$f":"IF(AW23=0,\"\",IF(NOT(ISNA(VLOOKUP(AW23,Answers!#REF!,2,FALSE))),VLOOKUP(AW23,Answers!#REF!,2,FALSE),\"Help!\"))","v":""},"","",{"$f":"Mainframe!P21","v":0},{"$f":"IF(BA23=0,\"\",IF(NOT(ISNA(VLOOKUP(BA23,Answers!#REF!,2,FALSE))),VLOOKUP(BA23,Answers!#REF!,2,FALSE),\"Help!\"))","v":""},"","",{"$f":"Mainframe!Q21","v":0},{"$f":"IF(BE23=0,\"\",IF(NOT(ISNA(VLOOKUP(BE23,Answers!#REF!,2,FALSE))),VLOOKUP(BE23,Answers!#REF!,2,FALSE),\"Help!\"))","v":""},"","","",null,"",""]
[{"$f":"Mainframe!B22","v":0},{"$f":"Mainframe!C22","v":0},{"$f":"IF(B24=0,\"\",IF(NOT(ISNA(VLOOKUP(B24,Answers!$A$2:$B$15,2,FALSE))),VLOOKUP(B24,Answers!$A$2:$B$15,2,FALSE),\"Help!\"))","v":""},"",{"$f":"Mainframe!D22","v":0},{"$f":"IF(E24=0,\"\",IF(NOT(ISNA(VLOOKUP(E24,Answers!#REF!,2,FALSE))),VLOOKUP(E24,Answers!#REF!,2,FALSE),\"Help!\"))","v":""},"","",{"$f":"Mainframe!E22","v":0},{"$f":"IF(I24=0,\"\",IF(NOT(ISNA(VLOOKUP(I24,Answers!#REF!,2,FALSE))),VLOOKUP(I24,Answers!#REF!,2,FALSE),\"Help!\"))","v":""},"","",{"$f":"Mainframe!F22","v":0},{"$f":"IF(M24=0,\"\",IF(NOT(ISNA(VLOOKUP(M24,Answers!#REF!,2,FALSE))),VLOOKUP(M24,Answers!#REF!,2,FALSE),\"Help!\"))","v":""},"","",{"$f":"Mainframe!G22","v":0},{"$f":"IF(Q24=0,\"\",IF(NOT(ISNA(VLOOKUP(Q24,Answers!#REF!,2,FALSE))),VLOOKUP(Q24,Answers!#REF!,2,FALSE),\"Help!\"))","v":""},"","",{"$f":"Mainframe!H22","v":0},{"$f":"IF(U24=0,\"\",IF(NOT(ISNA(VLOOKUP(U24,Answers!#REF!,2,FALSE))),VLOOKUP(U24,Answers!#REF!,2,FALSE),\"Help!\"))","v":""},"","",{"$f":"Mainframe!I22","v":0},{"$f":"IF(Y24=0,\"\",IF(NOT(ISNA(VLOOKUP(Y24,Answers!#REF!,3,FALSE))),VLOOKUP(Y24,Answers!#REF!,3,FALSE),\"Help!\"))","v":""},"","",{"$f":"Mainframe!J22","v":0},{"$f":"IF(AC24=0,\"\",IF(NOT(ISNA(VLOOKUP(AC24,Answers!#REF!,3,FALSE))),VLOOKUP(AC24,Answers!#REF!,3,FALSE),\"Help!\"))","v":""},"","",{"$f":"Mainframe!K22","v":0},{"$f":"IF(AG24=0,\"\",IF(NOT(ISNA(VLOOKUP(AG24,Answers!#REF!,3,FALSE))),VLOOKUP(AG24,Answers!#REF!,3,FALSE),\"Help!\"))","v":""},"","",{"$f":"Mainframe!L22","v":0},{"$f":"IF(AK24=0,\"\",IF(NOT(ISNA(VLOOKUP(AK24,Answers!#REF!,3,FALSE))),VLOOKUP(AK24,Answers!#REF!,3,FALSE),\"Help!\"))","v":""},"","",{"$f":"Mainframe!M22","v":0},{"$f":"IF(AO24=0,\"\",IF(NOT(ISNA(VLOOKUP(AO24,Answers!#REF!,2,FALSE))),VLOOKUP(AO24,Answers!#REF!,2,FALSE),\"Help!\"))","v":""},"","",{"$f":"Mainframe!N22","v":0},{"$f":"IF(AS24=0,\"\",IF(NOT(ISNA(VLOOKUP(AS24,Answers!#REF!,2,FALSE))),VLOOKUP(AS24,Answers!#REF!,2,FALSE),\"Help!\"))","v":""},"","",{"$f":"Mainframe!O22","v":0},{"$f":"IF(AW24=0,\"\",IF(NOT(ISNA(VLOOKUP(AW24,Answers!#REF!,2,FALSE))),VLOOKUP(AW24,Answers!#REF!,2,FALSE),\"Help!\"))","v":""},"","",{"$f":"Mainframe!P22","v":0},{"$f":"IF(BA24=0,\"\",IF(NOT(ISNA(VLOOKUP(BA24,Answers!#REF!,2,FALSE))),VLOOKUP(BA24,Answers!#REF!,2,FALSE),\"Help!\"))","v":""},"","",{"$f":"Mainframe!Q22","v":0},{"$f":"IF(BE24=0,\"\",IF(NOT(ISNA(VLOOKUP(BE24,Answers!#REF!,2,FALSE))),VLOOKUP(BE24,Answers!#REF!,2,FALSE),\"Help!\"))","v":""},"","","",null,"",""]
[{"$f":"Mainframe!B23","v":0},{"$f":"Mainframe!C23","v":0},{"$f":"IF(B25=0,\"\",IF(NOT(ISNA(VLOOKUP(B25,Answers!$A$2:$B$15,2,FALSE))),VLOOKUP(B25,Answers!$A$2:$B$15,2,FALSE),\"Help!\"))","v":""},"",{"$f":"Mainframe!D23","v":0},{"$f":"IF(E25=0,\"\",IF(NOT(ISNA(VLOOKUP(E25,Answers!#REF!,2,FALSE))),VLOOKUP(E25,Answers!#REF!,2,FALSE),\"Help!\"))","v":""},"","",{"$f":"Mainframe!E23","v":0},{"$f":"IF(I25=0,\"\",IF(NOT(ISNA(VLOOKUP(I25,Answers!#REF!,2,FALSE))),VLOOKUP(I25,Answers!#REF!,2,FALSE),\"Help!\"))","v":""},"","",{"$f":"Mainframe!F23","v":0},{"$f":"IF(M25=0,\"\",IF(NOT(ISNA(VLOOKUP(M25,Answers!#REF!,2,FALSE))),VLOOKUP(M25,Answers!#REF!,2,FALSE),\"Help!\"))","v":""},"","",{"$f":"Mainframe!G23","v":0},{"$f":"IF(Q25=0,\"\",IF(NOT(ISNA(VLOOKUP(Q25,Answers!#REF!,2,FALSE))),VLOOKUP(Q25,Answers!#REF!,2,FALSE),\"Help!\"))","v":""},"","",{"$f":"Mainframe!H23","v":0},{"$f":"IF(U25=0,\"\",IF(NOT(ISNA(VLOOKUP(U25,Answers!#REF!,2,FALSE))),VLOOKUP(U25,Answers!#REF!,2,FALSE),\"Help!\"))","v":""},"","",{"$f":"Mainframe!I23","v":0},{"$f":"IF(Y25=0,\"\",IF(NOT(ISNA(VLOOKUP(Y25,Answers!#REF!,3,FALSE))),VLOOKUP(Y25,Answers!#REF!,3,FALSE),\"Help!\"))","v":""},"","",{"$f":"Mainframe!J23","v":0},{"$f":"IF(AC25=0,\"\",IF(NOT(ISNA(VLOOKUP(AC25,Answers!#REF!,3,FALSE))),VLOOKUP(AC25,Answers!#REF!,3,FALSE),\"Help!\"))","v":""},"","",{"$f":"Mainframe!K23","v":0},{"$f":"IF(AG25=0,\"\",IF(NOT(ISNA(VLOOKUP(AG25,Answers!#REF!,3,FALSE))),VLOOKUP(AG25,Answers!#REF!,3,FALSE),\"Help!\"))","v":""},"","",{"$f":"Mainframe!L23","v":0},{"$f":"IF(AK25=0,\"\",IF(NOT(ISNA(VLOOKUP(AK25,Answers!#REF!,3,FALSE))),VLOOKUP(AK25,Answers!#REF!,3,FALSE),\"Help!\"))","v":""},"","",{"$f":"Mainframe!M23","v":0},{"$f":"IF(AO25=0,\"\",IF(NOT(ISNA(VLOOKUP(AO25,Answers!#REF!,2,FALSE))),VLOOKUP(AO25,Answers!#REF!,2,FALSE),\"Help!\"))","v":""},"","",{"$f":"Mainframe!N23","v":0},{"$f":"IF(AS25=0,\"\",IF(NOT(ISNA(VLOOKUP(AS25,Answers!#REF!,2,FALSE))),VLOOKUP(AS25,Answers!#REF!,2,FALSE),\"Help!\"))","v":""},"","",{"$f":"Mainframe!O23","v":0},{"$f":"IF(AW25=0,\"\",IF(NOT(ISNA(VLOOKUP(AW25,Answers!#REF!,2,FALSE))),VLOOKUP(AW25,Answers!#REF!,2,FALSE),\"Help!\"))","v":""},"","",{"$f":"Mainframe!P23","v":0},{"$f":"IF(BA25=0,\"\",IF(NOT(ISNA(VLOOKUP(BA25,Answers!#REF!,2,FALSE))),VLOOKUP(BA25,Answers!#REF!,2,FALSE),\"Help!\"))","v":""},"","",{"$f":"Mainframe!Q23","v":0},{"$f":"IF(BE25=0,\"\",IF(NOT(ISNA(VLOOKUP(BE25,Answers!#REF!,2,FALSE))),VLOOKUP(BE25,Answers!#REF!,2,FALSE),\"Help!\"))","v":""},"","","",null,"",""]
[{"$f":"Mainframe!B24","v":0},{"$f":"Mainframe!C24","v":0},{"$f":"IF(B26=0,\"\",IF(NOT(ISNA(VLOOKUP(B26,Answers!$A$2:$B$15,2,FALSE))),VLOOKUP(B26,Answers!$A$2:$B$15,2,FALSE),\"Help!\"))","v":""},"",{"$f":"Mainframe!D24","v":0},{"$f":"IF(E26=0,\"\",IF(NOT(ISNA(VLOOKUP(E26,Answers!#REF!,2,FALSE))),VLOOKUP(E26,Answers!#REF!,2,FALSE),\"Help!\"))","v":""},"","",{"$f":"Mainframe!E24","v":0},{"$f":"IF(I26=0,\"\",IF(NOT(ISNA(VLOOKUP(I26,Answers!#REF!,2,FALSE))),VLOOKUP(I26,Answers!#REF!,2,FALSE),\"Help!\"))","v":""},"","",{"$f":"Mainframe!F24","v":0},{"$f":"IF(M26=0,\"\",IF(NOT(ISNA(VLOOKUP(M26,Answers!#REF!,2,FALSE))),VLOOKUP(M26,Answers!#REF!,2,FALSE),\"Help!\"))","v":""},"","",{"$f":"Mainframe!G24","v":0},{"$f":"IF(Q26=0,\"\",IF(NOT(ISNA(VLOOKUP(Q26,Answers!#REF!,2,FALSE))),VLOOKUP(Q26,Answers!#REF!,2,FALSE),\"Help!\"))","v":""},"","",{"$f":"Mainframe!H24","v":0},{"$f":"IF(U26=0,\"\",IF(NOT(ISNA(VLOOKUP(U26,Answers!#REF!,2,FALSE))),VLOOKUP(U26,Answers!#REF!,2,FALSE),\"Help!\"))","v":""},"","",{"$f":"Mainframe!I24","v":0},{"$f":"IF(Y26=0,\"\",IF(NOT(ISNA(VLOOKUP(Y26,Answers!#REF!,3,FALSE))),VLOOKUP(Y26,Answers!#REF!,3,FALSE),\"Help!\"))","v":""},"","",{"$f":"Mainframe!J24","v":0},{"$f":"IF(AC26=0,\"\",IF(NOT(ISNA(VLOOKUP(AC26,Answers!#REF!,3,FALSE))),VLOOKUP(AC26,Answers!#REF!,3,FALSE),\"Help!\"))","v":""},"","",{"$f":"Mainframe!K24","v":0},{"$f":"IF(AG26=0,\"\",IF(NOT(ISNA(VLOOKUP(AG26,Answers!#REF!,3,FALSE))),VLOOKUP(AG26,Answers!#REF!,3,FALSE),\"Help!\"))","v":""},"","",{"$f":"Mainframe!L24","v":0},{"$f":"IF(AK26=0,\"\",IF(NOT(ISNA(VLOOKUP(AK26,Answers!#REF!,3,FALSE))),VLOOKUP(AK26,Answers!#REF!,3,FALSE),\"Help!\"))","v":""},"","",{"$f":"Mainframe!M24","v":0},{"$f":"IF(AO26=0,\"\",IF(NOT(ISNA(VLOOKUP(AO26,Answers!#REF!,2,FALSE))),VLOOKUP(AO26,Answers!#REF!,2,FALSE),\"Help!\"))","v":""},"","",{"$f":"Mainframe!N24","v":0},{"$f":"IF(AS26=0,\"\",IF(NOT(ISNA(VLOOKUP(AS26,Answers!#REF!,2,FALSE))),VLOOKUP(AS26,Answers!#REF!,2,FALSE),\"Help!\"))","v":""},"","",{"$f":"Mainframe!O24","v":0},{"$f":"IF(AW26=0,\"\",IF(NOT(ISNA(VLOOKUP(AW26,Answers!#REF!,2,FALSE))),VLOOKUP(AW26,Answers!#REF!,2,FALSE),\"Help!\"))","v":""},"","",{"$f":"Mainframe!P24","v":0},{"$f":"IF(BA26=0,\"\",IF(NOT(ISNA(VLOOKUP(BA26,Answers!#REF!,2,FALSE))),VLOOKUP(BA26,Answers!#REF!,2,FALSE),\"Help!\"))","v":""},"","",{"$f":"Mainframe!Q24","v":0},{"$f":"IF(BE26=0,\"\",IF(NOT(ISNA(VLOOKUP(BE26,Answers!#REF!,2,FALSE))),VLOOKUP(BE26,Answers!#REF!,2,FALSE),\"Help!\"))","v":""},"","","",null,"",""]
[{"$f":"Mainframe!B25","v":0},{"$f":"Mainframe!C25","v":0},{"$f":"IF(B27=0,\"\",IF(NOT(ISNA(VLOOKUP(B27,Answers!$A$2:$B$15,2,FALSE))),VLOOKUP(B27,Answers!$A$2:$B$15,2,FALSE),\"Help!\"))","v":""},"",{"$f":"Mainframe!D25","v":0},{"$f":"IF(E27=0,\"\",IF(NOT(ISNA(VLOOKUP(E27,Answers!#REF!,2,FALSE))),VLOOKUP(E27,Answers!#REF!,2,FALSE),\"Help!\"))","v":""},"","",{"$f":"Mainframe!E25","v":0},{"$f":"IF(I27=0,\"\",IF(NOT(ISNA(VLOOKUP(I27,Answers!#REF!,2,FALSE))),VLOOKUP(I27,Answers!#REF!,2,FALSE),\"Help!\"))","v":""},"","",{"$f":"Mainframe!F25","v":0},{"$f":"IF(M27=0,\"\",IF(NOT(ISNA(VLOOKUP(M27,Answers!#REF!,2,FALSE))),VLOOKUP(M27,Answers!#REF!,2,FALSE),\"Help!\"))","v":""},"","",{"$f":"Mainframe!G25","v":0},{"$f":"IF(Q27=0,\"\",IF(NOT(ISNA(VLOOKUP(Q27,Answers!#REF!,2,FALSE))),VLOOKUP(Q27,Answers!#REF!,2,FALSE),\"Help!\"))","v":""},"","",{"$f":"Mainframe!H25","v":0},{"$f":"IF(U27=0,\"\",IF(NOT(ISNA(VLOOKUP(U27,Answers!#REF!,2,FALSE))),VLOOKUP(U27,Answers!#REF!,2,FALSE),\"Help!\"))","v":""},"","",{"$f":"Mainframe!I25","v":0},{"$f":"IF(Y27=0,\"\",IF(NOT(ISNA(VLOOKUP(Y27,Answers!#REF!,3,FALSE))),VLOOKUP(Y27,Answers!#REF!,3,FALSE),\"Help!\"))","v":""},"","",{"$f":"Mainframe!J25","v":0},{"$f":"IF(AC27=0,\"\",IF(NOT(ISNA(VLOOKUP(AC27,Answers!#REF!,3,FALSE))),VLOOKUP(AC27,Answers!#REF!,3,FALSE),\"Help!\"))","v":""},"","",{"$f":"Mainframe!K25","v":0},{"$f":"IF(AG27=0,\"\",IF(NOT(ISNA(VLOOKUP(AG27,Answers!#REF!,3,FALSE))),VLOOKUP(AG27,Answers!#REF!,3,FALSE),\"Help!\"))","v":""},"","",{"$f":"Mainframe!L25","v":0},{"$f":"IF(AK27=0,\"\",IF(NOT(ISNA(VLOOKUP(AK27,Answers!#REF!,3,FALSE))),VLOOKUP(AK27,Answers!#REF!,3,FALSE),\"Help!\"))","v":""},"","",{"$f":"Mainframe!M25","v":0},{"$f":"IF(AO27=0,\"\",IF(NOT(ISNA(VLOOKUP(AO27,Answers!#REF!,2,FALSE))),VLOOKUP(AO27,Answers!#REF!,2,FALSE),\"Help!\"))","v":""},"","",{"$f":"Mainframe!N25","v":0},{"$f":"IF(AS27=0,\"\",IF(NOT(ISNA(VLOOKUP(AS27,Answers!#REF!,2,FALSE))),VLOOKUP(AS27,Answers!#REF!,2,FALSE),\"Help!\"))","v":""},"","",{"$f":"Mainframe!O25","v":0},{"$f":"IF(AW27=0,\"\",IF(NOT(ISNA(VLOOKUP(AW27,Answers!#REF!,2,FALSE))),VLOOKUP(AW27,Answers!#REF!,2,FALSE),\"Help!\"))","v":""},"","",{"$f":"Mainframe!P25","v":0},{"$f":"IF(BA27=0,\"\",IF(NOT(ISNA(VLOOKUP(BA27,Answers!#REF!,2,FALSE))),VLOOKUP(BA27,Answers!#REF!,2,FALSE),\"Help!\"))","v":""},"","",{"$f":"Mainframe!Q25","v":0},{"$f":"IF(BE27=0,\"\",IF(NOT(ISNA(VLOOKUP(BE27,Answers!#REF!,2,FALSE))),VLOOKUP(BE27,Answers!#REF!,2,FALSE),\"Help!\"))","v":""},"","","",null,"",""]
[{"$f":"Mainframe!B26","v":0},{"$f":"Mainframe!C26","v":0},{"$f":"IF(B28=0,\"\",IF(NOT(ISNA(VLOOKUP(B28,Answers!$A$2:$B$15,2,FALSE))),VLOOKUP(B28,Answers!$A$2:$B$15,2,FALSE),\"Help!\"))","v":""},"",{"$f":"Mainframe!D26","v":0},{"$f":"IF(E28=0,\"\",IF(NOT(ISNA(VLOOKUP(E28,Answers!#REF!,2,FALSE))),VLOOKUP(E28,Answers!#REF!,2,FALSE),\"Help!\"))","v":""},"","",{"$f":"Mainframe!E26","v":0},{"$f":"IF(I28=0,\"\",IF(NOT(ISNA(VLOOKUP(I28,Answers!#REF!,2,FALSE))),VLOOKUP(I28,Answers!#REF!,2,FALSE),\"Help!\"))","v":""},"","",{"$f":"Mainframe!F26","v":0},{"$f":"IF(M28=0,\"\",IF(NOT(ISNA(VLOOKUP(M28,Answers!#REF!,2,FALSE))),VLOOKUP(M28,Answers!#REF!,2,FALSE),\"Help!\"))","v":""},"","",{"$f":"Mainframe!G26","v":0},{"$f":"IF(Q28=0,\"\",IF(NOT(ISNA(VLOOKUP(Q28,Answers!#REF!,2,FALSE))),VLOOKUP(Q28,Answers!#REF!,2,FALSE),\"Help!\"))","v":""},"","",{"$f":"Mainframe!H26","v":0},{"$f":"IF(U28=0,\"\",IF(NOT(ISNA(VLOOKUP(U28,Answers!#REF!,2,FALSE))),VLOOKUP(U28,Answers!#REF!,2,FALSE),\"Help!\"))","v":""},"","",{"$f":"Mainframe!I26","v":0},{"$f":"IF(Y28=0,\"\",IF(NOT(ISNA(VLOOKUP(Y28,Answers!#REF!,3,FALSE))),VLOOKUP(Y28,Answers!#REF!,3,FALSE),\"Help!\"))","v":""},"","",{"$f":"Mainframe!J26","v":0},{"$f":"IF(AC28=0,\"\",IF(NOT(ISNA(VLOOKUP(AC28,Answers!#REF!,3,FALSE))),VLOOKUP(AC28,Answers!#REF!,3,FALSE),\"Help!\"))","v":""},"","",{"$f":"Mainframe!K26","v":0},{"$f":"IF(AG28=0,\"\",IF(NOT(ISNA(VLOOKUP(AG28,Answers!#REF!,3,FALSE))),VLOOKUP(AG28,Answers!#REF!,3,FALSE),\"Help!\"))","v":""},"","",{"$f":"Mainframe!L26","v":0},{"$f":"IF(AK28=0,\"\",IF(NOT(ISNA(VLOOKUP(AK28,Answers!#REF!,3,FALSE))),VLOOKUP(AK28,Answers!#REF!,3,FALSE),\"Help!\"))","v":""},"","",{"$f":"Mainframe!M26","v":0},{"$f":"IF(AO28=0,\"\",IF(NOT(ISNA(VLOOKUP(AO28,Answers!#REF!,2,FALSE))),VLOOKUP(AO28,Answers!#REF!,2,FALSE),\"Help!\"))","v":""},"","",{"$f":"Mainframe!N26","v":0},{"$f":"IF(AS28=0,\"\",IF(NOT(ISNA(VLOOKUP(AS28,Answers!#REF!,2,FALSE))),VLOOKUP(AS28,Answers!#REF!,2,FALSE),\"Help!\"))","v":""},"","",{"$f":"Mainframe!O26","v":0},{"$f":"IF(AW28=0,\"\",IF(NOT(ISNA(VLOOKUP(AW28,Answers!#REF!,2,FALSE))),VLOOKUP(AW28,Answers!#REF!,2,FALSE),\"Help!\"))","v":""},"","",{"$f":"Mainframe!P26","v":0},{"$f":"IF(BA28=0,\"\",IF(NOT(ISNA(VLOOKUP(BA28,Answers!#REF!,2,FALSE))),VLOOKUP(BA28,Answers!#REF!,2,FALSE),\"Help!\"))","v":""},"","",{"$f":"Mainframe!Q26","v":0},{"$f":"IF(BE28=0,\"\",IF(NOT(ISNA(VLOOKUP(BE28,Answers!#REF!,2,FALSE))),VLOOKUP(BE28,Answers!#REF!,2,FALSE),\"Help!\"))","v":""},"","","",null,"",""]
[{"$f":"Mainframe!B27","v":0},{"$f":"Mainframe!C27","v":0},{"$f":"IF(B29=0,\"\",IF(NOT(ISNA(VLOOKUP(B29,Answers!$A$2:$B$15,2,FALSE))),VLOOKUP(B29,Answers!$A$2:$B$15,2,FALSE),\"Help!\"))","v":""},"",{"$f":"Mainframe!D27","v":0},{"$f":"IF(E29=0,\"\",IF(NOT(ISNA(VLOOKUP(E29,Answers!#REF!,2,FALSE))),VLOOKUP(E29,Answers!#REF!,2,FALSE),\"Help!\"))","v":""},"","",{"$f":"Mainframe!E27","v":0},{"$f":"IF(I29=0,\"\",IF(NOT(ISNA(VLOOKUP(I29,Answers!#REF!,2,FALSE))),VLOOKUP(I29,Answers!#REF!,2,FALSE),\"Help!\"))","v":""},"","",{"$f":"Mainframe!F27","v":0},{"$f":"IF(M29=0,\"\",IF(NOT(ISNA(VLOOKUP(M29,Answers!#REF!,2,FALSE))),VLOOKUP(M29,Answers!#REF!,2,FALSE),\"Help!\"))","v":""},"","",{"$f":"Mainframe!G27","v":0},{"$f":"IF(Q29=0,\"\",IF(NOT(ISNA(VLOOKUP(Q29,Answers!#REF!,2,FALSE))),VLOOKUP(Q29,Answers!#REF!,2,FALSE),\"Help!\"))","v":""},"","",{"$f":"Mainframe!H27","v":0},{"$f":"IF(U29=0,\"\",IF(NOT(ISNA(VLOOKUP(U29,Answers!#REF!,2,FALSE))),VLOOKUP(U29,Answers!#REF!,2,FALSE),\"Help!\"))","v":""},"","",{"$f":"Mainframe!I27","v":0},{"$f":"IF(Y29=0,\"\",IF(NOT(ISNA(VLOOKUP(Y29,Answers!#REF!,3,FALSE))),VLOOKUP(Y29,Answers!#REF!,3,FALSE),\"Help!\"))","v":""},"","",{"$f":"Mainframe!J27","v":0},{"$f":"IF(AC29=0,\"\",IF(NOT(ISNA(VLOOKUP(AC29,Answers!#REF!,3,FALSE))),VLOOKUP(AC29,Answers!#REF!,3,FALSE),\"Help!\"))","v":""},"","",{"$f":"Mainframe!K27","v":0},{"$f":"IF(AG29=0,\"\",IF(NOT(ISNA(VLOOKUP(AG29,Answers!#REF!,3,FALSE))),VLOOKUP(AG29,Answers!#REF!,3,FALSE),\"Help!\"))","v":""},"","",{"$f":"Mainframe!L27","v":0},{"$f":"IF(AK29=0,\"\",IF(NOT(ISNA(VLOOKUP(AK29,Answers!#REF!,3,FALSE))),VLOOKUP(AK29,Answers!#REF!,3,FALSE),\"Help!\"))","v":""},"","",{"$f":"Mainframe!M27","v":0},{"$f":"IF(AO29=0,\"\",IF(NOT(ISNA(VLOOKUP(AO29,Answers!#REF!,2,FALSE))),VLOOKUP(AO29,Answers!#REF!,2,FALSE),\"Help!\"))","v":""},"","",{"$f":"Mainframe!N27","v":0},{"$f":"IF(AS29=0,\"\",IF(NOT(ISNA(VLOOKUP(AS29,Answers!#REF!,2,FALSE))),VLOOKUP(AS29,Answers!#REF!,2,FALSE),\"Help!\"))","v":""},"","",{"$f":"Mainframe!O27","v":0},{"$f":"IF(AW29=0,\"\",IF(NOT(ISNA(VLOOKUP(AW29,Answers!#REF!,2,FALSE))),VLOOKUP(AW29,Answers!#REF!,2,FALSE),\"Help!\"))","v":""},"","",{"$f":"Mainframe!P27","v":0},{"$f":"IF(BA29=0,\"\",IF(NOT(ISNA(VLOOKUP(BA29,Answers!#REF!,2,FALSE))),VLOOKUP(BA29,Answers!#REF!,2,FALSE),\"Help!\"))","v":""},"","",{"$f":"Mainframe!Q27","v":0},{"$f":"IF(BE29=0,\"\",IF(NOT(ISNA(VLOOKUP(BE29,Answers!#REF!,2,FALSE))),VLOOKUP(BE29,Answers!#REF!,2,FALSE),\"Help!\"))","v":""},"","","",null,"",""]
[{"$f":"Mainframe!B28","v":0},{"$f":"Mainframe!C28","v":0},{"$f":"IF(B30=0,\"\",IF(NOT(ISNA(VLOOKUP(B30,Answers!$A$2:$B$15,2,FALSE))),VLOOKUP(B30,Answers!$A$2:$B$15,2,FALSE),\"Help!\"))","v":""},"",{"$f":"Mainframe!D28","v":0},{"$f":"IF(E30=0,\"\",IF(NOT(ISNA(VLOOKUP(E30,Answers!#REF!,2,FALSE))),VLOOKUP(E30,Answers!#REF!,2,FALSE),\"Help!\"))","v":""},"","",{"$f":"Mainframe!E28","v":0},{"$f":"IF(I30=0,\"\",IF(NOT(ISNA(VLOOKUP(I30,Answers!#REF!,2,FALSE))),VLOOKUP(I30,Answers!#REF!,2,FALSE),\"Help!\"))","v":""},"","",{"$f":"Mainframe!F28","v":0},{"$f":"IF(M30=0,\"\",IF(NOT(ISNA(VLOOKUP(M30,Answers!#REF!,2,FALSE))),VLOOKUP(M30,Answers!#REF!,2,FALSE),\"Help!\"))","v":""},"","",{"$f":"Mainframe!G28","v":0},{"$f":"IF(Q30=0,\"\",IF(NOT(ISNA(VLOOKUP(Q30,Answers!#REF!,2,FALSE))),VLOOKUP(Q30,Answers!#REF!,2,FALSE),\"Help!\"))","v":""},"","",{"$f":"Mainframe!H28","v":0},{"$f":"IF(U30=0,\"\",IF(NOT(ISNA(VLOOKUP(U30,Answers!#REF!,2,FALSE))),VLOOKUP(U30,Answers!#REF!,2,FALSE),\"Help!\"))","v":""},"","",{"$f":"Mainframe!I28","v":0},{"$f":"IF(Y30=0,\"\",IF(NOT(ISNA(VLOOKUP(Y30,Answers!#REF!,3,FALSE))),VLOOKUP(Y30,Answers!#REF!,3,FALSE),\"Help!\"))","v":""},"","",{"$f":"Mainframe!J28","v":0},{"$f":"IF(AC30=0,\"\",IF(NOT(ISNA(VLOOKUP(AC30,Answers!#REF!,3,FALSE))),VLOOKUP(AC30,Answers!#REF!,3,FALSE),\"Help!\"))","v":""},"","",{"$f":"Mainframe!K28","v":0},{"$f":"IF(AG30=0,\"\",IF(NOT(ISNA(VLOOKUP(AG30,Answers!#REF!,3,FALSE))),VLOOKUP(AG30,Answers!#REF!,3,FALSE),\"Help!\"))","v":""},"","",{"$f":"Mainframe!L28","v":0},{"$f":"IF(AK30=0,\"\",IF(NOT(ISNA(VLOOKUP(AK30,Answers!#REF!,3,FALSE))),VLOOKUP(AK30,Answers!#REF!,3,FALSE),\"Help!\"))","v":""},"","",{"$f":"Mainframe!M28","v":0},{"$f":"IF(AO30=0,\"\",IF(NOT(ISNA(VLOOKUP(AO30,Answers!#REF!,2,FALSE))),VLOOKUP(AO30,Answers!#REF!,2,FALSE),\"Help!\"))","v":""},"","",{"$f":"Mainframe!N28","v":0},{"$f":"IF(AS30=0,\"\",IF(NOT(ISNA(VLOOKUP(AS30,Answers!#REF!,2,FALSE))),VLOOKUP(AS30,Answers!#REF!,2,FALSE),\"Help!\"))","v":""},"","",{"$f":"Mainframe!O28","v":0},{"$f":"IF(AW30=0,\"\",IF(NOT(ISNA(VLOOKUP(AW30,Answers!#REF!,2,FALSE))),VLOOKUP(AW30,Answers!#REF!,2,FALSE),\"Help!\"))","v":""},"","",{"$f":"Mainframe!P28","v":0},{"$f":"IF(BA30=0,\"\",IF(NOT(ISNA(VLOOKUP(BA30,Answers!#REF!,2,FALSE))),VLOOKUP(BA30,Answers!#REF!,2,FALSE),\"Help!\"))","v":""},"","",{"$f":"Mainframe!Q28","v":0},{"$f":"IF(BE30=0,\"\",IF(NOT(ISNA(VLOOKUP(BE30,Answers!#REF!,2,FALSE))),VLOOKUP(BE30,Answers!#REF!,2,FALSE),\"Help!\"))","v":""},"","","",null,"",""]
[{"$f":"Mainframe!B29","v":0},{"$f":"Mainframe!C29","v":0},{"$f":"IF(B31=0,\"\",IF(NOT(ISNA(VLOOKUP(B31,Answers!$A$2:$B$15,2,FALSE))),VLOOKUP(B31,Answers!$A$2:$B$15,2,FALSE),\"Help!\"))","v":""},"",{"$f":"Mainframe!D29","v":0},{"$f":"IF(E31=0,\"\",IF(NOT(ISNA(VLOOKUP(E31,Answers!#REF!,2,FALSE))),VLOOKUP(E31,Answers!#REF!,2,FALSE),\"Help!\"))","v":""},"","",{"$f":"Mainframe!E29","v":0},{"$f":"IF(I31=0,\"\",IF(NOT(ISNA(VLOOKUP(I31,Answers!#REF!,2,FALSE))),VLOOKUP(I31,Answers!#REF!,2,FALSE),\"Help!\"))","v":""},"","",{"$f":"Mainframe!F29","v":0},{"$f":"IF(M31=0,\"\",IF(NOT(ISNA(VLOOKUP(M31,Answers!#REF!,2,FALSE))),VLOOKUP(M31,Answers!#REF!,2,FALSE),\"Help!\"))","v":""},"","",{"$f":"Mainframe!G29","v":0},{"$f":"IF(Q31=0,\"\",IF(NOT(ISNA(VLOOKUP(Q31,Answers!#REF!,2,FALSE))),VLOOKUP(Q31,Answers!#REF!,2,FALSE),\"Help!\"))","v":""},"","",{"$f":"Mainframe!H29","v":0},{"$f":"IF(U31=0,\"\",IF(NOT(ISNA(VLOOKUP(U31,Answers!#REF!,2,FALSE))),VLOOKUP(U31,Answers!#REF!,2,FALSE),\"Help!\"))","v":""},"","",{"$f":"Mainframe!I29","v":0},{"$f":"IF(Y31=0,\"\",IF(NOT(ISNA(VLOOKUP(Y31,Answers!#REF!,3,FALSE))),VLOOKUP(Y31,Answers!#REF!,3,FALSE),\"Help!\"))","v":""},"","",{"$f":"Mainframe!J29","v":0},{"$f":"IF(AC31=0,\"\",IF(NOT(ISNA(VLOOKUP(AC31,Answers!#REF!,3,FALSE))),VLOOKUP(AC31,Answers!#REF!,3,FALSE),\"Help!\"))","v":""},"","",{"$f":"Mainframe!K29","v":0},{"$f":"IF(AG31=0,\"\",IF(NOT(ISNA(VLOOKUP(AG31,Answers!#REF!,3,FALSE))),VLOOKUP(AG31,Answers!#REF!,3,FALSE),\"Help!\"))","v":""},"","",{"$f":"Mainframe!L29","v":0},{"$f":"IF(AK31=0,\"\",IF(NOT(ISNA(VLOOKUP(AK31,Answers!#REF!,3,FALSE))),VLOOKUP(AK31,Answers!#REF!,3,FALSE),\"Help!\"))","v":""},"","",{"$f":"Mainframe!M29","v":0},{"$f":"IF(AO31=0,\"\",IF(NOT(ISNA(VLOOKUP(AO31,Answers!#REF!,2,FALSE))),VLOOKUP(AO31,Answers!#REF!,2,FALSE),\"Help!\"))","v":""},"","",{"$f":"Mainframe!N29","v":0},{"$f":"IF(AS31=0,\"\",IF(NOT(ISNA(VLOOKUP(AS31,Answers!#REF!,2,FALSE))),VLOOKUP(AS31,Answers!#REF!,2,FALSE),\"Help!\"))","v":""},"","",{"$f":"Mainframe!O29","v":0},{"$f":"IF(AW31=0,\"\",IF(NOT(ISNA(VLOOKUP(AW31,Answers!#REF!,2,FALSE))),VLOOKUP(AW31,Answers!#REF!,2,FALSE),\"Help!\"))","v":""},"","",{"$f":"Mainframe!P29","v":0},{"$f":"IF(BA31=0,\"\",IF(NOT(ISNA(VLOOKUP(BA31,Answers!#REF!,2,FALSE))),VLOOKUP(BA31,Answers!#REF!,2,FALSE),\"Help!\"))","v":""},"","",{"$f":"Mainframe!Q29","v":0},{"$f":"IF(BE31=0,\"\",IF(NOT(ISNA(VLOOKUP(BE31,Answers!#REF!,2,FALSE))),VLOOKUP(BE31,Answers!#REF!,2,FALSE),\"Help!\"))","v":""},"","","",null,"",""]
[{"$f":"Mainframe!B30","v":0},{"$f":"Mainframe!C30","v":0},{"$f":"IF(B32=0,\"\",IF(NOT(ISNA(VLOOKUP(B32,Answers!$A$2:$B$15,2,FALSE))),VLOOKUP(B32,Answers!$A$2:$B$15,2,FALSE),\"Help!\"))","v":""},"",{"$f":"Mainframe!D30","v":0},{"$f":"IF(E32=0,\"\",IF(NOT(ISNA(VLOOKUP(E32,Answers!#REF!,2,FALSE))),VLOOKUP(E32,Answers!#REF!,2,FALSE),\"Help!\"))","v":""},"","",{"$f":"Mainframe!E30","v":0},{"$f":"IF(I32=0,\"\",IF(NOT(ISNA(VLOOKUP(I32,Answers!#REF!,2,FALSE))),VLOOKUP(I32,Answers!#REF!,2,FALSE),\"Help!\"))","v":""},"","",{"$f":"Mainframe!F30","v":0},{"$f":"IF(M32=0,\"\",IF(NOT(ISNA(VLOOKUP(M32,Answers!#REF!,2,FALSE))),VLOOKUP(M32,Answers!#REF!,2,FALSE),\"Help!\"))","v":""},"","",{"$f":"Mainframe!G30","v":0},{"$f":"IF(Q32=0,\"\",IF(NOT(ISNA(VLOOKUP(Q32,Answers!#REF!,2,FALSE))),VLOOKUP(Q32,Answers!#REF!,2,FALSE),\"Help!\"))","v":""},"","",{"$f":"Mainframe!H30","v":0},{"$f":"IF(U32=0,\"\",IF(NOT(ISNA(VLOOKUP(U32,Answers!#REF!,2,FALSE))),VLOOKUP(U32,Answers!#REF!,2,FALSE),\"Help!\"))","v":""},"","",{"$f":"Mainframe!I30","v":0},{"$f":"IF(Y32=0,\"\",IF(NOT(ISNA(VLOOKUP(Y32,Answers!#REF!,3,FALSE))),VLOOKUP(Y32,Answers!#REF!,3,FALSE),\"Help!\"))","v":""},"","",{"$f":"Mainframe!J30","v":0},{"$f":"IF(AC32=0,\"\",IF(NOT(ISNA(VLOOKUP(AC32,Answers!#REF!,3,FALSE))),VLOOKUP(AC32,Answers!#REF!,3,FALSE),\"Help!\"))","v":""},"","",{"$f":"Mainframe!K30","v":0},{"$f":"IF(AG32=0,\"\",IF(NOT(ISNA(VLOOKUP(AG32,Answers!#REF!,3,FALSE))),VLOOKUP(AG32,Answers!#REF!,3,FALSE),\"Help!\"))","v":""},"","",{"$f":"Mainframe!L30","v":0},{"$f":"IF(AK32=0,\"\",IF(NOT(ISNA(VLOOKUP(AK32,Answers!#REF!,3,FALSE))),VLOOKUP(AK32,Answers!#REF!,3,FALSE),\"Help!\"))","v":""},"","",{"$f":"Mainframe!M30","v":0},{"$f":"IF(AO32=0,\"\",IF(NOT(ISNA(VLOOKUP(AO32,Answers!#REF!,2,FALSE))),VLOOKUP(AO32,Answers!#REF!,2,FALSE),\"Help!\"))","v":""},"","",{"$f":"Mainframe!N30","v":0},{"$f":"IF(AS32=0,\"\",IF(NOT(ISNA(VLOOKUP(AS32,Answers!#REF!,2,FALSE))),VLOOKUP(AS32,Answers!#REF!,2,FALSE),\"Help!\"))","v":""},"","",{"$f":"Mainframe!O30","v":0},{"$f":"IF(AW32=0,\"\",IF(NOT(ISNA(VLOOKUP(AW32,Answers!#REF!,2,FALSE))),VLOOKUP(AW32,Answers!#REF!,2,FALSE),\"Help!\"))","v":""},"","",{"$f":"Mainframe!P30","v":0},{"$f":"IF(BA32=0,\"\",IF(NOT(ISNA(VLOOKUP(BA32,Answers!#REF!,2,FALSE))),VLOOKUP(BA32,Answers!#REF!,2,FALSE),\"Help!\"))","v":""},"","",{"$f":"Mainframe!Q30","v":0},{"$f":"IF(BE32=0,\"\",IF(NOT(ISNA(VLOOKUP(BE32,Answers!#REF!,2,FALSE))),VLOOKUP(BE32,Answers!#REF!,2,FALSE),\"Help!\"))","v":""},"","","",null,"",""]
[{"$f":"Mainframe!B31","v":0},{"$f":"Mainframe!C31","v":0},{"$f":"IF(B33=0,\"\",IF(NOT(ISNA(VLOOKUP(B33,Answers!$A$2:$B$15,2,FALSE))),VLOOKUP(B33,Answers!$A$2:$B$15,2,FALSE),\"Help!\"))","v":""},"",{"$f":"Mainframe!D31","v":0},{"$f":"IF(E33=0,\"\",IF(NOT(ISNA(VLOOKUP(E33,Answers!#REF!,2,FALSE))),VLOOKUP(E33,Answers!#REF!,2,FALSE),\"Help!\"))","v":""},"","",{"$f":"Mainframe!E31","v":0},{"$f":"IF(I33=0,\"\",IF(NOT(ISNA(VLOOKUP(I33,Answers!#REF!,2,FALSE))),VLOOKUP(I33,Answers!#REF!,2,FALSE),\"Help!\"))","v":""},"","",{"$f":"Mainframe!F31","v":0},{"$f":"IF(M33=0,\"\",IF(NOT(ISNA(VLOOKUP(M33,Answers!#REF!,2,FALSE))),VLOOKUP(M33,Answers!#REF!,2,FALSE),\"Help!\"))","v":""},"","",{"$f":"Mainframe!G31","v":0},{"$f":"IF(Q33=0,\"\",IF(NOT(ISNA(VLOOKUP(Q33,Answers!#REF!,2,FALSE))),VLOOKUP(Q33,Answers!#REF!,2,FALSE),\"Help!\"))","v":""},"","",{"$f":"Mainframe!H31","v":0},{"$f":"IF(U33=0,\"\",IF(NOT(ISNA(VLOOKUP(U33,Answers!#REF!,2,FALSE))),VLOOKUP(U33,Answers!#REF!,2,FALSE),\"Help!\"))","v":""},"","",{"$f":"Mainframe!I31","v":0},{"$f":"IF(Y33=0,\"\",IF(NOT(ISNA(VLOOKUP(Y33,Answers!#REF!,3,FALSE))),VLOOKUP(Y33,Answers!#REF!,3,FALSE),\"Help!\"))","v":""},"","",{"$f":"Mainframe!J31","v":0},{"$f":"IF(AC33=0,\"\",IF(NOT(ISNA(VLOOKUP(AC33,Answers!#REF!,3,FALSE))),VLOOKUP(AC33,Answers!#REF!,3,FALSE),\"Help!\"))","v":""},"","",{"$f":"Mainframe!K31","v":0},{"$f":"IF(AG33=0,\"\",IF(NOT(ISNA(VLOOKUP(AG33,Answers!#REF!,3,FALSE))),VLOOKUP(AG33,Answers!#REF!,3,FALSE),\"Help!\"))","v":""},"","",{"$f":"Mainframe!L31","v":0},{"$f":"IF(AK33=0,\"\",IF(NOT(ISNA(VLOOKUP(AK33,Answers!#REF!,3,FALSE))),VLOOKUP(AK33,Answers!#REF!,3,FALSE),\"Help!\"))","v":""},"","",{"$f":"Mainframe!M31","v":0},{"$f":"IF(AO33=0,\"\",IF(NOT(ISNA(VLOOKUP(AO33,Answers!#REF!,2,FALSE))),VLOOKUP(AO33,Answers!#REF!,2,FALSE),\"Help!\"))","v":""},"","",{"$f":"Mainframe!N31","v":0},{"$f":"IF(AS33=0,\"\",IF(NOT(ISNA(VLOOKUP(AS33,Answers!#REF!,2,FALSE))),VLOOKUP(AS33,Answers!#REF!,2,FALSE),\"Help!\"))","v":""},"","",{"$f":"Mainframe!O31","v":0},{"$f":"IF(AW33=0,\"\",IF(NOT(ISNA(VLOOKUP(AW33,Answers!#REF!,2,FALSE))),VLOOKUP(AW33,Answers!#REF!,2,FALSE),\"Help!\"))","v":""},"","",{"$f":"Mainframe!P31","v":0},{"$f":"IF(BA33=0,\"\",IF(NOT(ISNA(VLOOKUP(BA33,Answers!#REF!,2,FALSE))),VLOOKUP(BA33,Answers!#REF!,2,FALSE),\"Help!\"))","v":""},"","",{"$f":"Mainframe!Q31","v":0},{"$f":"IF(BE33=0,\"\",IF(NOT(ISNA(VLOOKUP(BE33,Answers!#REF!,2,FALSE))),VLOOKUP(BE33,Answers!#REF!,2,FALSE),\"Help!\"))","v":""},"","","",null,"",""]
[{"$f":"Mainframe!B32","v":0},{"$f":"Mainframe!C32","v":0},{"$f":"IF(B34=0,\"\",IF(NOT(ISNA(VLOOKUP(B34,Answers!$A$2:$B$15,2,FALSE))),VLOOKUP(B34,Answers!$A$2:$B$15,2,FALSE),\"Help!\"))","v":""},"",{"$f":"Mainframe!D32","v":0},{"$f":"IF(E34=0,\"\",IF(NOT(ISNA(VLOOKUP(E34,Answers!#REF!,2,FALSE))),VLOOKUP(E34,Answers!#REF!,2,FALSE),\"Help!\"))","v":""},"","",{"$f":"Mainframe!E32","v":0},{"$f":"IF(I34=0,\"\",IF(NOT(ISNA(VLOOKUP(I34,Answers!#REF!,2,FALSE))),VLOOKUP(I34,Answers!#REF!,2,FALSE),\"Help!\"))","v":""},"","",{"$f":"Mainframe!F32","v":0},{"$f":"IF(M34=0,\"\",IF(NOT(ISNA(VLOOKUP(M34,Answers!#REF!,2,FALSE))),VLOOKUP(M34,Answers!#REF!,2,FALSE),\"Help!\"))","v":""},"","",{"$f":"Mainframe!G32","v":0},{"$f":"IF(Q34=0,\"\",IF(NOT(ISNA(VLOOKUP(Q34,Answers!#REF!,2,FALSE))),VLOOKUP(Q34,Answers!#REF!,2,FALSE),\"Help!\"))","v":""},"","",{"$f":"Mainframe!H32","v":0},{"$f":"IF(U34=0,\"\",IF(NOT(ISNA(VLOOKUP(U34,Answers!#REF!,2,FALSE))),VLOOKUP(U34,Answers!#REF!,2,FALSE),\"Help!\"))","v":""},"","",{"$f":"Mainframe!I32","v":0},{"$f":"IF(Y34=0,\"\",IF(NOT(ISNA(VLOOKUP(Y34,Answers!#REF!,3,FALSE))),VLOOKUP(Y34,Answers!#REF!,3,FALSE),\"Help!\"))","v":""},"","",{"$f":"Mainframe!J32","v":0},{"$f":"IF(AC34=0,\"\",IF(NOT(ISNA(VLOOKUP(AC34,Answers!#REF!,3,FALSE))),VLOOKUP(AC34,Answers!#REF!,3,FALSE),\"Help!\"))","v":""},"","",{"$f":"Mainframe!K32","v":0},{"$f":"IF(AG34=0,\"\",IF(NOT(ISNA(VLOOKUP(AG34,Answers!#REF!,3,FALSE))),VLOOKUP(AG34,Answers!#REF!,3,FALSE),\"Help!\"))","v":""},"","",{"$f":"Mainframe!L32","v":0},{"$f":"IF(AK34=0,\"\",IF(NOT(ISNA(VLOOKUP(AK34,Answers!#REF!,3,FALSE))),VLOOKUP(AK34,Answers!#REF!,3,FALSE),\"Help!\"))","v":""},"","",{"$f":"Mainframe!M32","v":0},{"$f":"IF(AO34=0,\"\",IF(NOT(ISNA(VLOOKUP(AO34,Answers!#REF!,2,FALSE))),VLOOKUP(AO34,Answers!#REF!,2,FALSE),\"Help!\"))","v":""},"","",{"$f":"Mainframe!N32","v":0},{"$f":"IF(AS34=0,\"\",IF(NOT(ISNA(VLOOKUP(AS34,Answers!#REF!,2,FALSE))),VLOOKUP(AS34,Answers!#REF!,2,FALSE),\"Help!\"))","v":""},"","",{"$f":"Mainframe!O32","v":0},{"$f":"IF(AW34=0,\"\",IF(NOT(ISNA(VLOOKUP(AW34,Answers!#REF!,2,FALSE))),VLOOKUP(AW34,Answers!#REF!,2,FALSE),\"Help!\"))","v":""},"","",{"$f":"Mainframe!P32","v":0},{"$f":"IF(BA34=0,\"\",IF(NOT(ISNA(VLOOKUP(BA34,Answers!#REF!,2,FALSE))),VLOOKUP(BA34,Answers!#REF!,2,FALSE),\"Help!\"))","v":""},"","",{"$f":"Mainframe!Q32","v":0},{"$f":"IF(BE34=0,\"\",IF(NOT(ISNA(VLOOKUP(BE34,Answers!#REF!,2,FALSE))),VLOOKUP(BE34,Answers!#REF!,2,FALSE),\"Help!\"))","v":""},"","","",null,"",""]
[{"$f":"Mainframe!B33","v":0},{"$f":"Mainframe!C33","v":0},{"$f":"IF(B35=0,\"\",IF(NOT(ISNA(VLOOKUP(B35,Answers!$A$2:$B$15,2,FALSE))),VLOOKUP(B35,Answers!$A$2:$B$15,2,FALSE),\"Help!\"))","v":""},"",{"$f":"Mainframe!D33","v":0},{"$f":"IF(E35=0,\"\",IF(NOT(ISNA(VLOOKUP(E35,Answers!#REF!,2,FALSE))),VLOOKUP(E35,Answers!#REF!,2,FALSE),\"Help!\"))","v":""},"","",{"$f":"Mainframe!E33","v":0},{"$f":"IF(I35=0,\"\",IF(NOT(ISNA(VLOOKUP(I35,Answers!#REF!,2,FALSE))),VLOOKUP(I35,Answers!#REF!,2,FALSE),\"Help!\"))","v":""},"","",{"$f":"Mainframe!F33","v":0},{"$f":"IF(M35=0,\"\",IF(NOT(ISNA(VLOOKUP(M35,Answers!#REF!,2,FALSE))),VLOOKUP(M35,Answers!#REF!,2,FALSE),\"Help!\"))","v":""},"","",{"$f":"Mainframe!G33","v":0},{"$f":"IF(Q35=0,\"\",IF(NOT(ISNA(VLOOKUP(Q35,Answers!#REF!,2,FALSE))),VLOOKUP(Q35,Answers!#REF!,2,FALSE),\"Help!\"))","v":""},"","",{"$f":"Mainframe!H33","v":0},{"$f":"IF(U35=0,\"\",IF(NOT(ISNA(VLOOKUP(U35,Answers!#REF!,2,FALSE))),VLOOKUP(U35,Answers!#REF!,2,FALSE),\"Help!\"))","v":""},"","",{"$f":"Mainframe!I33","v":0},{"$f":"IF(Y35=0,\"\",IF(NOT(ISNA(VLOOKUP(Y35,Answers!#REF!,3,FALSE))),VLOOKUP(Y35,Answers!#REF!,3,FALSE),\"Help!\"))","v":""},"","",{"$f":"Mainframe!J33","v":0},{"$f":"IF(AC35=0,\"\",IF(NOT(ISNA(VLOOKUP(AC35,Answers!#REF!,3,FALSE))),VLOOKUP(AC35,Answers!#REF!,3,FALSE),\"Help!\"))","v":""},"","",{"$f":"Mainframe!K33","v":0},{"$f":"IF(AG35=0,\"\",IF(NOT(ISNA(VLOOKUP(AG35,Answers!#REF!,3,FALSE))),VLOOKUP(AG35,Answers!#REF!,3,FALSE),\"Help!\"))","v":""},"","",{"$f":"Mainframe!L33","v":0},{"$f":"IF(AK35=0,\"\",IF(NOT(ISNA(VLOOKUP(AK35,Answers!#REF!,3,FALSE))),VLOOKUP(AK35,Answers!#REF!,3,FALSE),\"Help!\"))","v":""},"","",{"$f":"Mainframe!M33","v":0},{"$f":"IF(AO35=0,\"\",IF(NOT(ISNA(VLOOKUP(AO35,Answers!#REF!,2,FALSE))),VLOOKUP(AO35,Answers!#REF!,2,FALSE),\"Help!\"))","v":""},"","",{"$f":"Mainframe!N33","v":0},{"$f":"IF(AS35=0,\"\",IF(NOT(ISNA(VLOOKUP(AS35,Answers!#REF!,2,FALSE))),VLOOKUP(AS35,Answers!#REF!,2,FALSE),\"Help!\"))","v":""},"","",{"$f":"Mainframe!O33","v":0},{"$f":"IF(AW35=0,\"\",IF(NOT(ISNA(VLOOKUP(AW35,Answers!#REF!,2,FALSE))),VLOOKUP(AW35,Answers!#REF!,2,FALSE),\"Help!\"))","v":""},"","",{"$f":"Mainframe!P33","v":0},{"$f":"IF(BA35=0,\"\",IF(NOT(ISNA(VLOOKUP(BA35,Answers!#REF!,2,FALSE))),VLOOKUP(BA35,Answers!#REF!,2,FALSE),\"Help!\"))","v":""},"","",{"$f":"Mainframe!Q33","v":0},{"$f":"IF(BE35=0,\"\",IF(NOT(ISNA(VLOOKUP(BE35,Answers!#REF!,2,FALSE))),VLOOKUP(BE35,Answers!#REF!,2,FALSE),\"Help!\"))","v":""},"","","",null,"",""]
[{"$f":"Mainframe!B34","v":0},{"$f":"Mainframe!C34","v":0},{"$f":"IF(B36=0,\"\",IF(NOT(ISNA(VLOOKUP(B36,Answers!$A$2:$B$15,2,FALSE))),VLOOKUP(B36,Answers!$A$2:$B$15,2,FALSE),\"Help!\"))","v":""},"",{"$f":"Mainframe!D34","v":0},{"$f":"IF(E36=0,\"\",IF(NOT(ISNA(VLOOKUP(E36,Answers!#REF!,2,FALSE))),VLOOKUP(E36,Answers!#REF!,2,FALSE),\"Help!\"))","v":""},"","",{"$f":"Mainframe!E34","v":0},{"$f":"IF(I36=0,\"\",IF(NOT(ISNA(VLOOKUP(I36,Answers!#REF!,2,FALSE))),VLOOKUP(I36,Answers!#REF!,2,FALSE),\"Help!\"))","v":""},"","",{"$f":"Mainframe!F34","v":0},{"$f":"IF(M36=0,\"\",IF(NOT(ISNA(VLOOKUP(M36,Answers!#REF!,2,FALSE))),VLOOKUP(M36,Answers!#REF!,2,FALSE),\"Help!\"))","v":""},"","",{"$f":"Mainframe!G34","v":0},{"$f":"IF(Q36=0,\"\",IF(NOT(ISNA(VLOOKUP(Q36,Answers!#REF!,2,FALSE))),VLOOKUP(Q36,Answers!#REF!,2,FALSE),\"Help!\"))","v":""},"","",{"$f":"Mainframe!H34","v":0},{"$f":"IF(U36=0,\"\",IF(NOT(ISNA(VLOOKUP(U36,Answers!#REF!,2,FALSE))),VLOOKUP(U36,Answers!#REF!,2,FALSE),\"Help!\"))","v":""},"","",{"$f":"Mainframe!I34","v":0},{"$f":"IF(Y36=0,\"\",IF(NOT(ISNA(VLOOKUP(Y36,Answers!#REF!,3,FALSE))),VLOOKUP(Y36,Answers!#REF!,3,FALSE),\"Help!\"))","v":""},"","",{"$f":"Mainframe!J34","v":0},{"$f":"IF(AC36=0,\"\",IF(NOT(ISNA(VLOOKUP(AC36,Answers!#REF!,3,FALSE))),VLOOKUP(AC36,Answers!#REF!,3,FALSE),\"Help!\"))","v":""},"","",{"$f":"Mainframe!K34","v":0},{"$f":"IF(AG36=0,\"\",IF(NOT(ISNA(VLOOKUP(AG36,Answers!#REF!,3,FALSE))),VLOOKUP(AG36,Answers!#REF!,3,FALSE),\"Help!\"))","v":""},"","",{"$f":"Mainframe!L34","v":0},{"$f":"IF(AK36=0,\"\",IF(NOT(ISNA(VLOOKUP(AK36,Answers!#REF!,3,FALSE))),VLOOKUP(AK36,Answers!#REF!,3,FALSE),\"Help!\"))","v":""},"","",{"$f":"Mainframe!M34","v":0},{"$f":"IF(AO36=0,\"\",IF(NOT(ISNA(VLOOKUP(AO36,Answers!#REF!,2,FALSE))),VLOOKUP(AO36,Answers!#REF!,2,FALSE),\"Help!\"))","v":""},"","",{"$f":"Mainframe!N34","v":0},{"$f":"IF(AS36=0,\"\",IF(NOT(ISNA(VLOOKUP(AS36,Answers!#REF!,2,FALSE))),VLOOKUP(AS36,Answers!#REF!,2,FALSE),\"Help!\"))","v":""},"","",{"$f":"Mainframe!O34","v":0},{"$f":"IF(AW36=0,\"\",IF(NOT(ISNA(VLOOKUP(AW36,Answers!#REF!,2,FALSE))),VLOOKUP(AW36,Answers!#REF!,2,FALSE),\"Help!\"))","v":""},"","",{"$f":"Mainframe!P34","v":0},{"$f":"IF(BA36=0,\"\",IF(NOT(ISNA(VLOOKUP(BA36,Answers!#REF!,2,FALSE))),VLOOKUP(BA36,Answers!#REF!,2,FALSE),\"Help!\"))","v":""},"","",{"$f":"Mainframe!Q34","v":0},{"$f":"IF(BE36=0,\"\",IF(NOT(ISNA(VLOOKUP(BE36,Answers!#REF!,2,FALSE))),VLOOKUP(BE36,Answers!#REF!,2,FALSE),\"Help!\"))","v":""},"","","",null,"",""]
[{"$f":"Mainframe!B35","v":0},{"$f":"Mainframe!C35","v":0},{"$f":"IF(B37=0,\"\",IF(NOT(ISNA(VLOOKUP(B37,Answers!$A$2:$B$15,2,FALSE))),VLOOKUP(B37,Answers!$A$2:$B$15,2,FALSE),\"Help!\"))","v":""},"",{"$f":"Mainframe!D35","v":0},{"$f":"IF(E37=0,\"\",IF(NOT(ISNA(VLOOKUP(E37,Answers!#REF!,2,FALSE))),VLOOKUP(E37,Answers!#REF!,2,FALSE),\"Help!\"))","v":""},"","",{"$f":"Mainframe!E35","v":0},{"$f":"IF(I37=0,\"\",IF(NOT(ISNA(VLOOKUP(I37,Answers!#REF!,2,FALSE))),VLOOKUP(I37,Answers!#REF!,2,FALSE),\"Help!\"))","v":""},"","",{"$f":"Mainframe!F35","v":0},{"$f":"IF(M37=0,\"\",IF(NOT(ISNA(VLOOKUP(M37,Answers!#REF!,2,FALSE))),VLOOKUP(M37,Answers!#REF!,2,FALSE),\"Help!\"))","v":""},"","",{"$f":"Mainframe!G35","v":0},{"$f":"IF(Q37=0,\"\",IF(NOT(ISNA(VLOOKUP(Q37,Answers!#REF!,2,FALSE))),VLOOKUP(Q37,Answers!#REF!,2,FALSE),\"Help!\"))","v":""},"","",{"$f":"Mainframe!H35","v":0},{"$f":"IF(U37=0,\"\",IF(NOT(ISNA(VLOOKUP(U37,Answers!#REF!,2,FALSE))),VLOOKUP(U37,Answers!#REF!,2,FALSE),\"Help!\"))","v":""},"","",{"$f":"Mainframe!I35","v":0},{"$f":"IF(Y37=0,\"\",IF(NOT(ISNA(VLOOKUP(Y37,Answers!#REF!,3,FALSE))),VLOOKUP(Y37,Answers!#REF!,3,FALSE),\"Help!\"))","v":""},"","",{"$f":"Mainframe!J35","v":0},{"$f":"IF(AC37=0,\"\",IF(NOT(ISNA(VLOOKUP(AC37,Answers!#REF!,3,FALSE))),VLOOKUP(AC37,Answers!#REF!,3,FALSE),\"Help!\"))","v":""},"","",{"$f":"Mainframe!K35","v":0},{"$f":"IF(AG37=0,\"\",IF(NOT(ISNA(VLOOKUP(AG37,Answers!#REF!,3,FALSE))),VLOOKUP(AG37,Answers!#REF!,3,FALSE),\"Help!\"))","v":""},"","",{"$f":"Mainframe!L35","v":0},{"$f":"IF(AK37=0,\"\",IF(NOT(ISNA(VLOOKUP(AK37,Answers!#REF!,3,FALSE))),VLOOKUP(AK37,Answers!#REF!,3,FALSE),\"Help!\"))","v":""},"","",{"$f":"Mainframe!M35","v":0},{"$f":"IF(AO37=0,\"\",IF(NOT(ISNA(VLOOKUP(AO37,Answers!#REF!,2,FALSE))),VLOOKUP(AO37,Answers!#REF!,2,FALSE),\"Help!\"))","v":""},"","",{"$f":"Mainframe!N35","v":0},{"$f":"IF(AS37=0,\"\",IF(NOT(ISNA(VLOOKUP(AS37,Answers!#REF!,2,FALSE))),VLOOKUP(AS37,Answers!#REF!,2,FALSE),\"Help!\"))","v":""},"","",{"$f":"Mainframe!O35","v":0},{"$f":"IF(AW37=0,\"\",IF(NOT(ISNA(VLOOKUP(AW37,Answers!#REF!,2,FALSE))),VLOOKUP(AW37,Answers!#REF!,2,FALSE),\"Help!\"))","v":""},"","",{"$f":"Mainframe!P35","v":0},{"$f":"IF(BA37=0,\"\",IF(NOT(ISNA(VLOOKUP(BA37,Answers!#REF!,2,FALSE))),VLOOKUP(BA37,Answers!#REF!,2,FALSE),\"Help!\"))","v":""},"","",{"$f":"Mainframe!Q35","v":0},{"$f":"IF(BE37=0,\"\",IF(NOT(ISNA(VLOOKUP(BE37,Answers!#REF!,2,FALSE))),VLOOKUP(BE37,Answers!#REF!,2,FALSE),\"Help!\"))","v":""},"","","",null,"",""]
[{"$f":"Mainframe!B36","v":0},{"$f":"Mainframe!C36","v":0},{"$f":"IF(B38=0,\"\",IF(NOT(ISNA(VLOOKUP(B38,Answers!$A$2:$B$15,2,FALSE))),VLOOKUP(B38,Answers!$A$2:$B$15,2,FALSE),\"Help!\"))","v":""},"",{"$f":"Mainframe!D36","v":0},{"$f":"IF(E38=0,\"\",IF(NOT(ISNA(VLOOKUP(E38,Answers!#REF!,2,FALSE))),VLOOKUP(E38,Answers!#REF!,2,FALSE),\"Help!\"))","v":""},"","",{"$f":"Mainframe!E36","v":0},{"$f":"IF(I38=0,\"\",IF(NOT(ISNA(VLOOKUP(I38,Answers!#REF!,2,FALSE))),VLOOKUP(I38,Answers!#REF!,2,FALSE),\"Help!\"))","v":""},"","",{"$f":"Mainframe!F36","v":0},{"$f":"IF(M38=0,\"\",IF(NOT(ISNA(VLOOKUP(M38,Answers!#REF!,2,FALSE))),VLOOKUP(M38,Answers!#REF!,2,FALSE),\"Help!\"))","v":""},"","",{"$f":"Mainframe!G36","v":0},{"$f":"IF(Q38=0,\"\",IF(NOT(ISNA(VLOOKUP(Q38,Answers!#REF!,2,FALSE))),VLOOKUP(Q38,Answers!#REF!,2,FALSE),\"Help!\"))","v":""},"","",{"$f":"Mainframe!H36","v":0},{"$f":"IF(U38=0,\"\",IF(NOT(ISNA(VLOOKUP(U38,Answers!#REF!,2,FALSE))),VLOOKUP(U38,Answers!#REF!,2,FALSE),\"Help!\"))","v":""},"","",{"$f":"Mainframe!I36","v":0},{"$f":"IF(Y38=0,\"\",IF(NOT(ISNA(VLOOKUP(Y38,Answers!#REF!,3,FALSE))),VLOOKUP(Y38,Answers!#REF!,3,FALSE),\"Help!\"))","v":""},"","",{"$f":"Mainframe!J36","v":0},{"$f":"IF(AC38=0,\"\",IF(NOT(ISNA(VLOOKUP(AC38,Answers!#REF!,3,FALSE))),VLOOKUP(AC38,Answers!#REF!,3,FALSE),\"Help!\"))","v":""},"","",{"$f":"Mainframe!K36","v":0},{"$f":"IF(AG38=0,\"\",IF(NOT(ISNA(VLOOKUP(AG38,Answers!#REF!,3,FALSE))),VLOOKUP(AG38,Answers!#REF!,3,FALSE),\"Help!\"))","v":""},"","",{"$f":"Mainframe!L36","v":0},{"$f":"IF(AK38=0,\"\",IF(NOT(ISNA(VLOOKUP(AK38,Answers!#REF!,3,FALSE))),VLOOKUP(AK38,Answers!#REF!,3,FALSE),\"Help!\"))","v":""},"","",{"$f":"Mainframe!M36","v":0},{"$f":"IF(AO38=0,\"\",IF(NOT(ISNA(VLOOKUP(AO38,Answers!#REF!,2,FALSE))),VLOOKUP(AO38,Answers!#REF!,2,FALSE),\"Help!\"))","v":""},"","",{"$f":"Mainframe!N36","v":0},{"$f":"IF(AS38=0,\"\",IF(NOT(ISNA(VLOOKUP(AS38,Answers!#REF!,2,FALSE))),VLOOKUP(AS38,Answers!#REF!,2,FALSE),\"Help!\"))","v":""},"","",{"$f":"Mainframe!O36","v":0},{"$f":"IF(AW38=0,\"\",IF(NOT(ISNA(VLOOKUP(AW38,Answers!#REF!,2,FALSE))),VLOOKUP(AW38,Answers!#REF!,2,FALSE),\"Help!\"))","v":""},"","",{"$f":"Mainframe!P36","v":0},{"$f":"IF(BA38=0,\"\",IF(NOT(ISNA(VLOOKUP(BA38,Answers!#REF!,2,FALSE))),VLOOKUP(BA38,Answers!#REF!,2,FALSE),\"Help!\"))","v":""},"","",{"$f":"Mainframe!Q36","v":0},{"$f":"IF(BE38=0,\"\",IF(NOT(ISNA(VLOOKUP(BE38,Answers!#REF!,2,FALSE))),VLOOKUP(BE38,Answers!#REF!,2,FALSE),\"Help!\"))","v":""},"","","",null,"",""]
[{"$f":"Mainframe!B37","v":0},{"$f":"Mainframe!C37","v":0},{"$f":"IF(B39=0,\"\",IF(NOT(ISNA(VLOOKUP(B39,Answers!$A$2:$B$15,2,FALSE))),VLOOKUP(B39,Answers!$A$2:$B$15,2,FALSE),\"Help!\"))","v":""},"",{"$f":"Mainframe!D37","v":0},{"$f":"IF(E39=0,\"\",IF(NOT(ISNA(VLOOKUP(E39,Answers!#REF!,2,FALSE))),VLOOKUP(E39,Answers!#REF!,2,FALSE),\"Help!\"))","v":""},"","",{"$f":"Mainframe!E37","v":0},{"$f":"IF(I39=0,\"\",IF(NOT(ISNA(VLOOKUP(I39,Answers!#REF!,2,FALSE))),VLOOKUP(I39,Answers!#REF!,2,FALSE),\"Help!\"))","v":""},"","",{"$f":"Mainframe!F37","v":0},{"$f":"IF(M39=0,\"\",IF(NOT(ISNA(VLOOKUP(M39,Answers!#REF!,2,FALSE))),VLOOKUP(M39,Answers!#REF!,2,FALSE),\"Help!\"))","v":""},"","",{"$f":"Mainframe!G37","v":0},{"$f":"IF(Q39=0,\"\",IF(NOT(ISNA(VLOOKUP(Q39,Answers!#REF!,2,FALSE))),VLOOKUP(Q39,Answers!#REF!,2,FALSE),\"Help!\"))","v":""},"","",{"$f":"Mainframe!H37","v":0},{"$f":"IF(U39=0,\"\",IF(NOT(ISNA(VLOOKUP(U39,Answers!#REF!,2,FALSE))),VLOOKUP(U39,Answers!#REF!,2,FALSE),\"Help!\"))","v":""},"","",{"$f":"Mainframe!I37","v":0},{"$f":"IF(Y39=0,\"\",IF(NOT(ISNA(VLOOKUP(Y39,Answers!#REF!,3,FALSE))),VLOOKUP(Y39,Answers!#REF!,3,FALSE),\"Help!\"))","v":""},"","",{"$f":"Mainframe!J37","v":0},{"$f":"IF(AC39=0,\"\",IF(NOT(ISNA(VLOOKUP(AC39,Answers!#REF!,3,FALSE))),VLOOKUP(AC39,Answers!#REF!,3,FALSE),\"Help!\"))","v":""},"","",{"$f":"Mainframe!K37","v":0},{"$f":"IF(AG39=0,\"\",IF(NOT(ISNA(VLOOKUP(AG39,Answers!#REF!,3,FALSE))),VLOOKUP(AG39,Answers!#REF!,3,FALSE),\"Help!\"))","v":""},"","",{"$f":"Mainframe!L37","v":0},{"$f":"IF(AK39=0,\"\",IF(NOT(ISNA(VLOOKUP(AK39,Answers!#REF!,3,FALSE))),VLOOKUP(AK39,Answers!#REF!,3,FALSE),\"Help!\"))","v":""},"","",{"$f":"Mainframe!M37","v":0},{"$f":"IF(AO39=0,\"\",IF(NOT(ISNA(VLOOKUP(AO39,Answers!#REF!,2,FALSE))),VLOOKUP(AO39,Answers!#REF!,2,FALSE),\"Help!\"))","v":""},"","",{"$f":"Mainframe!N37","v":0},{"$f":"IF(AS39=0,\"\",IF(NOT(ISNA(VLOOKUP(AS39,Answers!#REF!,2,FALSE))),VLOOKUP(AS39,Answers!#REF!,2,FALSE),\"Help!\"))","v":""},"","",{"$f":"Mainframe!O37","v":0},{"$f":"IF(AW39=0,\"\",IF(NOT(ISNA(VLOOKUP(AW39,Answers!#REF!,2,FALSE))),VLOOKUP(AW39,Answers!#REF!,2,FALSE),\"Help!\"))","v":""},"","",{"$f":"Mainframe!P37","v":0},{"$f":"IF(BA39=0,\"\",IF(NOT(ISNA(VLOOKUP(BA39,Answers!#REF!,2,FALSE))),VLOOKUP(BA39,Answers!#REF!,2,FALSE),\"Help!\"))","v":""},"","",{"$f":"Mainframe!Q37","v":0},{"$f":"IF(BE39=0,\"\",IF(NOT(ISNA(VLOOKUP(BE39,Answers!#REF!,2,FALSE))),VLOOKUP(BE39,Answers!#REF!,2,FALSE),\"Help!\"))","v":""},"","","",null,"",""]
[{"$f":"Mainframe!B38","v":0},{"$f":"Mainframe!C38","v":0},{"$f":"IF(B40=0,\"\",IF(NOT(ISNA(VLOOKUP(B40,Answers!$A$2:$B$15,2,FALSE))),VLOOKUP(B40,Answers!$A$2:$B$15,2,FALSE),\"Help!\"))","v":""},"",{"$f":"Mainframe!D38","v":0},{"$f":"IF(E40=0,\"\",IF(NOT(ISNA(VLOOKUP(E40,Answers!#REF!,2,FALSE))),VLOOKUP(E40,Answers!#REF!,2,FALSE),\"Help!\"))","v":""},"","",{"$f":"Mainframe!E38","v":0},{"$f":"IF(I40=0,\"\",IF(NOT(ISNA(VLOOKUP(I40,Answers!#REF!,2,FALSE))),VLOOKUP(I40,Answers!#REF!,2,FALSE),\"Help!\"))","v":""},"","",{"$f":"Mainframe!F38","v":0},{"$f":"IF(M40=0,\"\",IF(NOT(ISNA(VLOOKUP(M40,Answers!#REF!,2,FALSE))),VLOOKUP(M40,Answers!#REF!,2,FALSE),\"Help!\"))","v":""},"","",{"$f":"Mainframe!G38","v":0},{"$f":"IF(Q40=0,\"\",IF(NOT(ISNA(VLOOKUP(Q40,Answers!#REF!,2,FALSE))),VLOOKUP(Q40,Answers!#REF!,2,FALSE),\"Help!\"))","v":""},"","",{"$f":"Mainframe!H38","v":0},{"$f":"IF(U40=0,\"\",IF(NOT(ISNA(VLOOKUP(U40,Answers!#REF!,2,FALSE))),VLOOKUP(U40,Answers!#REF!,2,FALSE),\"Help!\"))","v":""},"","",{"$f":"Mainframe!I38","v":0},{"$f":"IF(Y40=0,\"\",IF(NOT(ISNA(VLOOKUP(Y40,Answers!#REF!,3,FALSE))),VLOOKUP(Y40,Answers!#REF!,3,FALSE),\"Help!\"))","v":""},"","",{"$f":"Mainframe!J38","v":0},{"$f":"IF(AC40=0,\"\",IF(NOT(ISNA(VLOOKUP(AC40,Answers!#REF!,3,FALSE))),VLOOKUP(AC40,Answers!#REF!,3,FALSE),\"Help!\"))","v":""},"","",{"$f":"Mainframe!K38","v":0},{"$f":"IF(AG40=0,\"\",IF(NOT(ISNA(VLOOKUP(AG40,Answers!#REF!,3,FALSE))),VLOOKUP(AG40,Answers!#REF!,3,FALSE),\"Help!\"))","v":""},"","",{"$f":"Mainframe!L38","v":0},{"$f":"IF(AK40=0,\"\",IF(NOT(ISNA(VLOOKUP(AK40,Answers!#REF!,3,FALSE))),VLOOKUP(AK40,Answers!#REF!,3,FALSE),\"Help!\"))","v":""},"","",{"$f":"Mainframe!M38","v":0},{"$f":"IF(AO40=0,\"\",IF(NOT(ISNA(VLOOKUP(AO40,Answers!#REF!,2,FALSE))),VLOOKUP(AO40,Answers!#REF!,2,FALSE),\"Help!\"))","v":""},"","",{"$f":"Mainframe!N38","v":0},{"$f":"IF(AS40=0,\"\",IF(NOT(ISNA(VLOOKUP(AS40,Answers!#REF!,2,FALSE))),VLOOKUP(AS40,Answers!#REF!,2,FALSE),\"Help!\"))","v":""},"","",{"$f":"Mainframe!O38","v":0},{"$f":"IF(AW40=0,\"\",IF(NOT(ISNA(VLOOKUP(AW40,Answers!#REF!,2,FALSE))),VLOOKUP(AW40,Answers!#REF!,2,FALSE),\"Help!\"))","v":""},"","",{"$f":"Mainframe!P38","v":0},{"$f":"IF(BA40=0,\"\",IF(NOT(ISNA(VLOOKUP(BA40,Answers!#REF!,2,FALSE))),VLOOKUP(BA40,Answers!#REF!,2,FALSE),\"Help!\"))","v":""},"","",{"$f":"Mainframe!Q38","v":0},{"$f":"IF(BE40=0,\"\",IF(NOT(ISNA(VLOOKUP(BE40,Answers!#REF!,2,FALSE))),VLOOKUP(BE40,Answers!#REF!,2,FALSE),\"Help!\"))","v":""},"","","",null,"",""]
[{"$f":"Mainframe!B39","v":0},{"$f":"Mainframe!C39","v":0},{"$f":"IF(B41=0,\"\",IF(NOT(ISNA(VLOOKUP(B41,Answers!$A$2:$B$15,2,FALSE))),VLOOKUP(B41,Answers!$A$2:$B$15,2,FALSE),\"Help!\"))","v":""},"",{"$f":"Mainframe!D39","v":0},{"$f":"IF(E41=0,\"\",IF(NOT(ISNA(VLOOKUP(E41,Answers!#REF!,2,FALSE))),VLOOKUP(E41,Answers!#REF!,2,FALSE),\"Help!\"))","v":""},"","",{"$f":"Mainframe!E39","v":0},{"$f":"IF(I41=0,\"\",IF(NOT(ISNA(VLOOKUP(I41,Answers!#REF!,2,FALSE))),VLOOKUP(I41,Answers!#REF!,2,FALSE),\"Help!\"))","v":""},"","",{"$f":"Mainframe!F39","v":0},{"$f":"IF(M41=0,\"\",IF(NOT(ISNA(VLOOKUP(M41,Answers!#REF!,2,FALSE))),VLOOKUP(M41,Answers!#REF!,2,FALSE),\"Help!\"))","v":""},"","",{"$f":"Mainframe!G39","v":0},{"$f":"IF(Q41=0,\"\",IF(NOT(ISNA(VLOOKUP(Q41,Answers!#REF!,2,FALSE))),VLOOKUP(Q41,Answers!#REF!,2,FALSE),\"Help!\"))","v":""},"","",{"$f":"Mainframe!H39","v":0},{"$f":"IF(U41=0,\"\",IF(NOT(ISNA(VLOOKUP(U41,Answers!#REF!,2,FALSE))),VLOOKUP(U41,Answers!#REF!,2,FALSE),\"Help!\"))","v":""},"","",{"$f":"Mainframe!I39","v":0},{"$f":"IF(Y41=0,\"\",IF(NOT(ISNA(VLOOKUP(Y41,Answers!#REF!,3,FALSE))),VLOOKUP(Y41,Answers!#REF!,3,FALSE),\"Help!\"))","v":""},"","",{"$f":"Mainframe!J39","v":0},{"$f":"IF(AC41=0,\"\",IF(NOT(ISNA(VLOOKUP(AC41,Answers!#REF!,3,FALSE))),VLOOKUP(AC41,Answers!#REF!,3,FALSE),\"Help!\"))","v":""},"","",{"$f":"Mainframe!K39","v":0},{"$f":"IF(AG41=0,\"\",IF(NOT(ISNA(VLOOKUP(AG41,Answers!#REF!,3,FALSE))),VLOOKUP(AG41,Answers!#REF!,3,FALSE),\"Help!\"))","v":""},"","",{"$f":"Mainframe!L39","v":0},{"$f":"IF(AK41=0,\"\",IF(NOT(ISNA(VLOOKUP(AK41,Answers!#REF!,3,FALSE))),VLOOKUP(AK41,Answers!#REF!,3,FALSE),\"Help!\"))","v":""},"","",{"$f":"Mainframe!M39","v":0},{"$f":"IF(AO41=0,\"\",IF(NOT(ISNA(VLOOKUP(AO41,Answers!#REF!,2,FALSE))),VLOOKUP(AO41,Answers!#REF!,2,FALSE),\"Help!\"))","v":""},"","",{"$f":"Mainframe!N39","v":0},{"$f":"IF(AS41=0,\"\",IF(NOT(ISNA(VLOOKUP(AS41,Answers!#REF!,2,FALSE))),VLOOKUP(AS41,Answers!#REF!,2,FALSE),\"Help!\"))","v":""},"","",{"$f":"Mainframe!O39","v":0},{"$f":"IF(AW41=0,\"\",IF(NOT(ISNA(VLOOKUP(AW41,Answers!#REF!,2,FALSE))),VLOOKUP(AW41,Answers!#REF!,2,FALSE),\"Help!\"))","v":""},"","",{"$f":"Mainframe!P39","v":0},{"$f":"IF(BA41=0,\"\",IF(NOT(ISNA(VLOOKUP(BA41,Answers!#REF!,2,FALSE))),VLOOKUP(BA41,Answers!#REF!,2,FALSE),\"Help!\"))","v":""},"","",{"$f":"Mainframe!Q39","v":0},{"$f":"IF(BE41=0,\"\",IF(NOT(ISNA(VLOOKUP(BE41,Answers!#REF!,2,FALSE))),VLOOKUP(BE41,Answers!#REF!,2,FALSE),\"Help!\"))","v":""},"","","",null,"",""]
[{"$f":"Mainframe!B40","v":0},{"$f":"Mainframe!C40","v":0},{"$f":"IF(B42=0,\"\",IF(NOT(ISNA(VLOOKUP(B42,Answers!$A$2:$B$15,2,FALSE))),VLOOKUP(B42,Answers!$A$2:$B$15,2,FALSE),\"Help!\"))","v":""},"",{"$f":"Mainframe!D40","v":0},{"$f":"IF(E42=0,\"\",IF(NOT(ISNA(VLOOKUP(E42,Answers!#REF!,2,FALSE))),VLOOKUP(E42,Answers!#REF!,2,FALSE),\"Help!\"))","v":""},"","",{"$f":"Mainframe!E40","v":0},{"$f":"IF(I42=0,\"\",IF(NOT(ISNA(VLOOKUP(I42,Answers!#REF!,2,FALSE))),VLOOKUP(I42,Answers!#REF!,2,FALSE),\"Help!\"))","v":""},"","",{"$f":"Mainframe!F40","v":0},{"$f":"IF(M42=0,\"\",IF(NOT(ISNA(VLOOKUP(M42,Answers!#REF!,2,FALSE))),VLOOKUP(M42,Answers!#REF!,2,FALSE),\"Help!\"))","v":""},"","",{"$f":"Mainframe!G40","v":0},{"$f":"IF(Q42=0,\"\",IF(NOT(ISNA(VLOOKUP(Q42,Answers!#REF!,2,FALSE))),VLOOKUP(Q42,Answers!#REF!,2,FALSE),\"Help!\"))","v":""},"","",{"$f":"Mainframe!H40","v":0},{"$f":"IF(U42=0,\"\",IF(NOT(ISNA(VLOOKUP(U42,Answers!#REF!,2,FALSE))),VLOOKUP(U42,Answers!#REF!,2,FALSE),\"Help!\"))","v":""},"","",{"$f":"Mainframe!I40","v":0},{"$f":"IF(Y42=0,\"\",IF(NOT(ISNA(VLOOKUP(Y42,Answers!#REF!,3,FALSE))),VLOOKUP(Y42,Answers!#REF!,3,FALSE),\"Help!\"))","v":""},"","",{"$f":"Mainframe!J40","v":0},{"$f":"IF(AC42=0,\"\",IF(NOT(ISNA(VLOOKUP(AC42,Answers!#REF!,3,FALSE))),VLOOKUP(AC42,Answers!#REF!,3,FALSE),\"Help!\"))","v":""},"","",{"$f":"Mainframe!K40","v":0},{"$f":"IF(AG42=0,\"\",IF(NOT(ISNA(VLOOKUP(AG42,Answers!#REF!,3,FALSE))),VLOOKUP(AG42,Answers!#REF!,3,FALSE),\"Help!\"))","v":""},"","",{"$f":"Mainframe!L40","v":0},{"$f":"IF(AK42=0,\"\",IF(NOT(ISNA(VLOOKUP(AK42,Answers!#REF!,3,FALSE))),VLOOKUP(AK42,Answers!#REF!,3,FALSE),\"Help!\"))","v":""},"","",{"$f":"Mainframe!M40","v":0},{"$f":"IF(AO42=0,\"\",IF(NOT(ISNA(VLOOKUP(AO42,Answers!#REF!,2,FALSE))),VLOOKUP(AO42,Answers!#REF!,2,FALSE),\"Help!\"))","v":""},"","",{"$f":"Mainframe!N40","v":0},{"$f":"IF(AS42=0,\"\",IF(NOT(ISNA(VLOOKUP(AS42,Answers!#REF!,2,FALSE))),VLOOKUP(AS42,Answers!#REF!,2,FALSE),\"Help!\"))","v":""},"","",{"$f":"Mainframe!O40","v":0},{"$f":"IF(AW42=0,\"\",IF(NOT(ISNA(VLOOKUP(AW42,Answers!#REF!,2,FALSE))),VLOOKUP(AW42,Answers!#REF!,2,FALSE),\"Help!\"))","v":""},"","",{"$f":"Mainframe!P40","v":0},{"$f":"IF(BA42=0,\"\",IF(NOT(ISNA(VLOOKUP(BA42,Answers!#REF!,2,FALSE))),VLOOKUP(BA42,Answers!#REF!,2,FALSE),\"Help!\"))","v":""},"","",{"$f":"Mainframe!Q40","v":0},{"$f":"IF(BE42=0,\"\",IF(NOT(ISNA(VLOOKUP(BE42,Answers!#REF!,2,FALSE))),VLOOKUP(BE42,Answers!#REF!,2,FALSE),\"Help!\"))","v":""},"","","",null,"",""]
[{"$f":"Mainframe!B41","v":0},{"$f":"Mainframe!C41","v":0},{"$f":"IF(B43=0,\"\",IF(NOT(ISNA(VLOOKUP(B43,Answers!$A$2:$B$15,2,FALSE))),VLOOKUP(B43,Answers!$A$2:$B$15,2,FALSE),\"Help!\"))","v":""},"",{"$f":"Mainframe!D41","v":0},{"$f":"IF(E43=0,\"\",IF(NOT(ISNA(VLOOKUP(E43,Answers!#REF!,2,FALSE))),VLOOKUP(E43,Answers!#REF!,2,FALSE),\"Help!\"))","v":""},"","",{"$f":"Mainframe!E41","v":0},{"$f":"IF(I43=0,\"\",IF(NOT(ISNA(VLOOKUP(I43,Answers!#REF!,2,FALSE))),VLOOKUP(I43,Answers!#REF!,2,FALSE),\"Help!\"))","v":""},"","",{"$f":"Mainframe!F41","v":0},{"$f":"IF(M43=0,\"\",IF(NOT(ISNA(VLOOKUP(M43,Answers!#REF!,2,FALSE))),VLOOKUP(M43,Answers!#REF!,2,FALSE),\"Help!\"))","v":""},"","",{"$f":"Mainframe!G41","v":0},{"$f":"IF(Q43=0,\"\",IF(NOT(ISNA(VLOOKUP(Q43,Answers!#REF!,2,FALSE))),VLOOKUP(Q43,Answers!#REF!,2,FALSE),\"Help!\"))","v":""},"","",{"$f":"Mainframe!H41","v":0},{"$f":"IF(U43=0,\"\",IF(NOT(ISNA(VLOOKUP(U43,Answers!#REF!,2,FALSE))),VLOOKUP(U43,Answers!#REF!,2,FALSE),\"Help!\"))","v":""},"","",{"$f":"Mainframe!I41","v":0},{"$f":"IF(Y43=0,\"\",IF(NOT(ISNA(VLOOKUP(Y43,Answers!#REF!,3,FALSE))),VLOOKUP(Y43,Answers!#REF!,3,FALSE),\"Help!\"))","v":""},"","",{"$f":"Mainframe!J41","v":0},{"$f":"IF(AC43=0,\"\",IF(NOT(ISNA(VLOOKUP(AC43,Answers!#REF!,3,FALSE))),VLOOKUP(AC43,Answers!#REF!,3,FALSE),\"Help!\"))","v":""},"","",{"$f":"Mainframe!K41","v":0},{"$f":"IF(AG43=0,\"\",IF(NOT(ISNA(VLOOKUP(AG43,Answers!#REF!,3,FALSE))),VLOOKUP(AG43,Answers!#REF!,3,FALSE),\"Help!\"))","v":""},"","",{"$f":"Mainframe!L41","v":0},{"$f":"IF(AK43=0,\"\",IF(NOT(ISNA(VLOOKUP(AK43,Answers!#REF!,3,FALSE))),VLOOKUP(AK43,Answers!#REF!,3,FALSE),\"Help!\"))","v":""},"","",{"$f":"Mainframe!M41","v":0},{"$f":"IF(AO43=0,\"\",IF(NOT(ISNA(VLOOKUP(AO43,Answers!#REF!,2,FALSE))),VLOOKUP(AO43,Answers!#REF!,2,FALSE),\"Help!\"))","v":""},"","",{"$f":"Mainframe!N41","v":0},{"$f":"IF(AS43=0,\"\",IF(NOT(ISNA(VLOOKUP(AS43,Answers!#REF!,2,FALSE))),VLOOKUP(AS43,Answers!#REF!,2,FALSE),\"Help!\"))","v":""},"","",{"$f":"Mainframe!O41","v":0},{"$f":"IF(AW43=0,\"\",IF(NOT(ISNA(VLOOKUP(AW43,Answers!#REF!,2,FALSE))),VLOOKUP(AW43,Answers!#REF!,2,FALSE),\"Help!\"))","v":""},"","",{"$f":"Mainframe!P41","v":0},{"$f":"IF(BA43=0,\"\",IF(NOT(ISNA(VLOOKUP(BA43,Answers!#REF!,2,FALSE))),VLOOKUP(BA43,Answers!#REF!,2,FALSE),\"Help!\"))","v":""},"","",{"$f":"Mainframe!Q41","v":0},{"$f":"IF(BE43=0,\"\",IF(NOT(ISNA(VLOOKUP(BE43,Answers!#REF!,2,FALSE))),VLOOKUP(BE43,Answers!#REF!,2,FALSE),\"Help!\"))","v":""},"","","",null,"",""]